program: Gaussian 09
title: 000211747
version: EM64L-G09RevD.01
frameworkgroup: C1[X(C14H14N2O)]
method: RPBEPBE
basis: SDD
operation: Freq
keyword: #p
keyword: freq=noraman
keyword: PBEPBE/SDD
title: #p freq=noraman PBEPBE/SDD
converged: YES YES NO NO
title: Mulliken charges:
elementType: O N N C C C C C C C C C C C C C C H H H H H H H H H H H H H H
charge: -0.359858 -0.123177 -0.661939 0.142208 0.304751 0.183064 0.104074 -0.356022 -0.363302 -0.381352 -0.344976 -0.225640 -0.234037 -0.226783 -0.240578 -0.232711 -0.520859 0.248531 0.275493 0.224035 0.246087 0.225967 0.227609 0.228433 0.226445 0.229881 0.389143 0.308231 0.230306 0.228636 0.248338
chargesum: 0.00000
title: Mulliken charges with hydrogens summed into heavy atoms:
elementType: O N N C C C C C C C C C C C C C C
charge: -0.359858 -0.123177 0.035436 0.142208 0.304751 0.183064 0.104074 -0.107491 -0.087809 -0.157317 -0.098889 0.000327 -0.006428 0.001650 -0.014133 -0.002829 0.186421
polarizability: 2.89327160e+02 1.59413786e+01 1.71492567e+02 3.78775065e+00 -1.22723521e+01 8.58655145e+01
1716.lowfreq: -7.6948 -4.3097 -0.0005 0.0005 0.0008 4.4473 41.1799 45.7531 67.9970
frequency: 41.1401 45.7455 67.9840 96.6064 121.0187 126.7571 140.8344 171.3725 205.2980 262.8759 283.6620 308.5764 354.0507 402.1648 410.0603 440.7131 472.9512 483.2485 517.0031 518.4849 570.4982 579.3331 616.0913 641.6241 665.5054 701.2448 703.4783 731.8854 743.7890 761.0731 775.4412 787.7873 822.0492 857.1292 866.2249 934.8783 941.7828 950.3534 976.9519 983.6273 989.7262 1003.7076 1022.0141 1026.9675 1049.3407 1079.6643 1093.1854 1117.2614 1139.0833 1149.9286 1159.7825 1171.4080 1176.7127 1185.7266 1237.1238 1261.3138 1311.8846 1352.3538 1369.0278 1385.5281 1423.1069 1433.8798 1439.6107 1457.3688 1460.0148 1474.1477 1485.3635 1557.7010 1573.6713 1587.8096 1610.5081 1611.4545 1636.6044 2972.8673 3068.7258 3119.3971 3119.9556 3129.7529 3130.1462 3142.6296 3143.5493 3156.3864 3159.4474 3169.2785 3172.0735 3372.1492 3627.8608
redmass: 3.9237 4.3525 4.6795 2.7949 4.2427 4.0282 1.1902 3.2539 5.3083 5.0648 5.1605 5.1172 3.9391 3.8402 3.1458 3.2107 1.4159 4.6143 4.5652 2.9551 3.8624 5.2802 6.2894 4.6743 4.0981 1.7504 4.3081 1.3088 3.5071 1.5425 2.2386 2.5889 4.8374 1.2466 1.5054 1.4359 1.9145 3.1269 1.3147 1.4495 4.8908 1.3418 2.6705 2.0912 2.2838 1.6840 1.8605 1.2500 2.0046 1.4006 1.0784 1.0780 2.2729 1.1291 2.0719 2.1178 1.3469 6.3939 3.6820 9.0361 1.5378 2.0567 1.8590 1.0652 2.4078 1.0567 2.5627 6.1945 3.4045 4.4422 3.5274 6.2295 2.0533 1.0301 1.1052 1.0862 1.1022 1.0849 1.0875 1.0895 1.0930 1.0947 1.0971 1.1008 1.0981 1.0573 1.0929
irintensity: 0.4774 0.6189 3.0625 3.0568 0.7105 6.2475 0.8225 5.2267 12.9030 3.1333 1.0523 7.2086 1.7121 16.6127 3.6426 26.3336 73.5965 1.9170 15.1421 49.9391 1.4076 0.5380 0.2482 5.0131 4.1828 44.7778 8.5783 82.9238 21.6939 67.3686 89.4759 16.9513 12.1684 1.7967 1.3538 5.0553 7.8783 44.9161 0.0485 1.8658 0.0968 2.9986 1.9668 27.7788 20.2212 27.8636 14.8245 0.7393 4.5526 3.0202 1.2017 2.3597 40.6182 6.4313 18.2148 9.8724 3.9570 13.9504 103.2898 0.8275 1.7183 6.2940 16.6428 9.0059 43.0524 7.9994 21.2152 13.4282 263.0904 12.8701 16.7672 0.8742 400.8738 52.8857 30.9462 6.2101 22.1231 2.3696 1.7204 10.1345 29.4331 21.4410 29.1407 26.8024 16.0541 127.5782 50.0589
temp: 298.150 k
press: 1.00000 atm
elementType: 8 7 7 6 6 6 6 6 6 6 6 6 6 6 6 6 6 1 1 1 1 1 1 1 1 1 1 1 1 1 1
symmnumber: 1
zpe: 649563.3 jmol-1
zpe.correction: 0.247406 hartree
zpe.thermalcorrener: 0.262481 hartree
zpe.thermalcorrenthalpy: 0.263425 hartree
zpe.thermalcorrgfe: 0.204631 hartree
zpe.sumelectzpe: -725.396382 hartree
zpe.sumelectthermal: -725.381307 hartree
zpe.sumelectthermalent: -725.380362 hartree
zpe.sumelectthermalfe: -725.439156 hartree
dipole: 1.1896 1.9355 0.0373
dipole: 2.2722
quadrupole: -86.3168 -88.1699 -102.0398
quadrupole: 1.7753 -2.2729 -0.8311
quadrupole: 5.8587 4.0056 -9.8643 1.7753 -2.2729 -0.8311
hfenergy: -725.6437872 hartree
pointgroup: C01 [X(C14H14N2O1)]
dipole: -0.4712087 -0.3720353 -0.662334 debye
polarizability: 289.396115|11.9137761|94.6205656|11.2494275|28.5461405|162.6685613 unknown
InChI: InChI=1S/C14H14N2O/c1-17-13-10-6-5-9-12(13)16-14(15)11-7-3-2-4-8-11/h2-10H,15H2,1H3
charge 0 multiplicity 1
31 atoms
O  2.021306 -0.895448 -1.6537
N  0.24298 0.097628 0.596684
N  -0.324036 0.502419 -1.719148
C  1.645215 0.234213 0.536527
C  -2.084336 0.149666 -0.040385
C  2.529767 -0.232342 -0.491288
C  -0.626926 0.239692 -0.391926
C  2.26152 0.861895 1.663202
C  -2.490475 0.378363 1.300494
C  -3.072279 -0.164309 -1.012229
C  3.923818 -0.036354 -0.420467
C  3.651411 1.068582 1.735375
C  4.495241 0.626077 0.686492
C  -3.85162 0.309631 1.658993
C  -4.436839 -0.232559 -0.652552
C  -4.832364 0.008664 0.682794
C  1.582342 -2.287079 -1.405042
H  1.598234 1.192611 2.469021
H  -1.712165 0.599801 2.03668
H  -2.781147 -0.397679 -2.043551
H  4.539841 -0.406769 -1.246975
H  4.079254 1.571306 2.609844
H  5.577901 0.782608 0.736425
H  -4.151311 0.492815 2.696899
H  -5.18758 -0.483632 -1.410209
H  -5.890916 -0.042779 0.961242
H  0.615576 0.267388 -2.067548
H  -1.048154 0.817225 -2.360825
H  2.44563 -2.899239 -1.084938
H  1.191864 -2.657049 -2.365431
H  0.792746 -2.320645 -0.631655
