program: Gaussian 09
title: 000217123
version: EM64L-G09RevD.01
frameworkgroup: C1[X(C9H13ClN2)]
method: RPBEPBE
basis: SDD
operation: Freq
keyword: #p
keyword: freq=noraman
keyword: PBEPBE/SDD
title: #p freq=noraman PBEPBE/SDD
converged: YES YES NO NO
title: Mulliken charges:
elementType: Cl N N C C C C C C C C C H H H H H H H H H H H H H
charge: -0.080494 -0.303780 -0.566125 -0.086892 -0.564319 0.603816 -0.732913 -0.322470 -0.398658 -0.229288 -0.239106 -0.230939 0.221447 0.228088 0.227249 0.212956 0.222718 0.240041 0.276798 0.242921 0.254770 0.231162 0.235119 0.293421 0.264477
chargesum: 0.00000
title: Mulliken charges with hydrogens summed into heavy atoms:
elementType: Cl N N C C C C C C C C C
charge: -0.080494 -0.026981 -0.008226 0.134555 -0.108982 0.603816 -0.057198 -0.322470 -0.155738 0.025482 -0.007943 0.004180
polarizability: 1.50484683e+02 1.13733727e+01 1.29093661e+02 -8.43566816e+00 6.90150082e+00 7.52582500e+01
1716.lowfreq: -9.7409 -8.6898 -2.9303 -0.0018 0.0015 0.0022 36.1358 56.1562 86.0479
frequency: 36.1350 56.1477 86.0433 129.6547 157.1491 202.7238 213.7238 242.5383 271.4110 337.6785 339.7786 380.2688 425.4305 444.5760 456.1199 487.8267 530.7585 587.4397 637.0201 661.7844 707.3383 720.6075 756.6270 828.2420 846.2617 873.2110 889.1981 941.8972 948.7410 985.0204 1012.1730 1035.5980 1060.2438 1062.1101 1130.4901 1144.5484 1171.5675 1175.6147 1206.0532 1214.2714 1230.6701 1272.6795 1287.3135 1327.5908 1347.7743 1373.2210 1386.4029 1424.9965 1451.2969 1460.1667 1462.7790 1478.4092 1479.2620 1572.1271 1605.0548 1662.2523 2871.2120 2978.8318 2992.4199 3057.8941 3069.1990 3093.9690 3126.9056 3142.0293 3158.3662 3174.2235 3362.3237 3427.2233 3545.3631
redmass: 4.1297 5.0812 4.0151 2.7725 4.5763 1.2225 3.9534 2.2984 3.4321 1.8947 3.2201 3.1364 3.2156 3.0270 2.2731 2.3291 3.3938 2.9223 2.5652 5.6427 1.3205 4.2663 1.2353 2.8126 2.5143 1.5417 1.3977 1.5195 1.4622 1.3286 6.0369 2.0511 2.9048 1.6806 1.5949 2.9678 1.0768 2.1696 1.4300 2.2529 1.2493 1.2713 1.5187 1.3821 1.2724 6.8482 1.2458 2.1781 1.1501 1.4730 1.6206 1.0601 1.0609 6.0619 7.1987 1.0661 1.0818 1.0365 1.0591 1.1021 1.0988 1.0989 1.0870 1.0896 1.0948 1.0997 1.0486 1.0758 1.0931
irintensity: 0.9533 0.7012 0.1222 1.8273 0.4960 0.7447 4.5362 0.8828 10.2078 13.2776 4.4599 9.6842 3.9131 17.3105 8.4216 26.3764 5.2678 141.5518 151.9070 43.5462 92.4275 5.6238 84.3706 4.5016 11.9413 3.4248 6.5705 9.4079 2.6989 0.0174 41.5008 4.4497 8.8460 16.8980 5.1415 21.8895 0.0711 5.6047 7.1786 0.1447 9.2374 8.8574 1.9929 0.3302 19.5240 2.3639 25.9514 18.5665 5.0933 17.5654 25.6182 10.5797 3.2017 7.3341 0.8315 22.8657 52.7381 29.9990 19.3874 11.7715 36.5192 26.7499 4.6551 10.2503 16.7314 13.3347 10.0192 2.6975 1.3736
temp: 298.150 k
press: 1.00000 atm
elementType: 17 7 7 6 6 6 6 6 6 6 6 6 1 1 1 1 1 1 1 1 1 1 1 1 1
symmnumber: 1
zpe: 539611.4 jmol-1
zpe.correction: 0.205527 hartree
zpe.thermalcorrener: 0.217975 hartree
zpe.thermalcorrenthalpy: 0.218920 hartree
zpe.thermalcorrgfe: 0.166204 hartree
zpe.sumelectzpe: -919.368757 hartree
zpe.sumelectthermal: -919.356309 hartree
zpe.sumelectthermalent: -919.355365 hartree
zpe.sumelectthermalfe: -919.408080 hartree
dipole: -2.0736 -1.3097 0.6233
dipole: 2.5305
quadrupole: -80.9547 -76.3244 -79.4329
quadrupole: 1.1486 0.8305 -0.0125
quadrupole: -2.0507 2.5796 -0.5289 1.1486 0.8305 -0.0125
hfenergy: -919.5742845 hartree
pointgroup: C01 [X(C9H13Cl1N2)]
dipole: 0.8207044 0.5303713 0.1906505 debye
dipolederiv: -0.3395123 -0.2658494 0.0346874 -0.2525567 -0.6041711 0.0832797 0.0542181 0.0848341 -0.1011821 -0.3471736 0.0319198 -0.1170899 0.2309369 -0.1193122 0.1594806 -0.1698903 0.1890978 -0.281629 -0.8675597 -0.1998074 0.0627355 -0.1858228 -0.1117132 -0.0991662 0.2247511 0.0612172 -0.0595108 0.583534 -0.0368354 0.0556726 -0.018304 0.1917138 -0.0506841 -0.2275585 -0.0537833 0.2954963 -0.2172399 -0.0415894 0.0477821 -0.0316084 0.0701636 -0.0315198 0.2039644 -0.0973448 0.0201132 0.3424389 -0.1422758 0.0214025 -0.0644466 -0.2415048 0.0566436 0.1151107 0.0398431 -0.0463114 -0.0625173 -0.0786541 -0.0151006 -0.055962 -0.0629957 -0.0790326 -0.0119168 -0.0992223 0.0419995 0.2721468 0.4175323 -0.0329788 0.4412264 0.8039456 -0.1582328 -0.0958608 -0.1668595 -0.0364367 -0.1032005 0.051215 0.032275 -0.0874156 0.057766 -0.0720167 0.0533881 -0.0513438 -0.1281017 -0.1226787 -0.1051271 0.0268001 -0.1271285 -0.1325825 -0.0194698 0.027739 -0.0164988 -0.0876414 -0.0055564 0.0579427 0.004329 0.0781482 0.0467713 -0.0524617 0.0048531 -0.0540456 -0.1287378 0.0422281 -0.0159703 0.0659702 0.0366875 -0.0206723 -0.0413548 0.0365331 -0.0500322 -0.1388934 -0.0621517 -0.010283 -0.0649884 0.070036 -0.1014691 0.1296247 -0.0727512 0.0670617 -0.1048158 0.0267459 0.0189708 -0.0091982 0.0298773 -0.0388201 0.1315224 -0.0289023 0.0744986 -0.001634 0.0741138 -0.0040021 -0.0493061 0.0046641 -0.0443177 -0.1146278 -0.0401943 -0.0583037 0.0337564 -0.0156531 0.0555515 0.1454373 0.0154392 0.065967 -0.0156806 0.1435402 -0.0536816 -0.0912568 0.0761421 0.0653816 -0.0352687 0.0476005 -0.0203329 0.0628792 -0.0618264 0.1394435 -0.0258094 -0.0979166 -0.0753567 -0.069329 -0.0706223 0.0667416 -0.0015958 -0.0767367 0.0123899 0.0895144 0.0932315 -0.0271546 0.0604985 -0.081921 0.119598 -0.0797209 0.1847952 -0.1542696 0.0729249 0.0458106 0.0723763 -0.0544958 0.0577701 -0.0409105 0.0617199 -0.050325 0.0701269 0.1126575 0.0717285 0.0369568 -0.0275451 0.0580253 -0.0052555 0.0631007 -0.0390814 0.0612883 0.1370533 0.0158193 -0.0928847 0.0055475 -0.1107114 -0.0412564 0.047442 0.0030523 0.0477071 0.1460534 -0.1093665 -0.0076405 -0.0518414 -0.0059355 0.0835831 0.0236882 -0.0565722 0.024315 0.1448901 0.4113748 0.0953605 0.1137254 -0.0126169 0.0906831 -0.0269081 0.0448119 -0.0384191 0.0279753 0.2952119 0.2002233 -0.149721 0.0346401 -0.011619 0.0230907 -0.1651414 0.0219811 0.109526 unknown
polarizability: 150.8605439|11.4502248|128.717655|4.7929684|-9.2677432|75.258395 unknown
InChI: InChI=1S/C9H13ClN2/c1-7(12-11)6-8-4-2-3-5-9(8)10/h2-5,7,12H,6,11H2,1H3
charge 0 multiplicity 1
25 atoms
Cl 0.121807 -2.517995 0.296739
N  -3.351843 0.213223 0.127641
N  -3.730018 -1.151048 -0.099271
C  -1.92671 0.45112 0.492807
C  -1.039635 0.234095 -0.771429
C  0.443864 0.181505 -0.466126
C  -1.797231 1.874942 1.063492
C  1.089473 -0.973816 0.039889
C  1.270487 1.322548 -0.661499
C  2.462269 -1.022936 0.347709
C  2.650182 1.307948 -0.363106
C  3.249605 0.133172 0.145429
H  -1.590233 -0.279426 1.270461
H  -1.25963 1.049817 -1.484122
H  -1.357726 -0.716721 -1.239949
H  -2.392849 1.987265 1.98957
H  -2.159632 2.616219 0.327424
H  -0.746732 2.104549 1.309604
H  -3.992714 0.630929 0.816253
H  0.808455 2.232281 -1.06295
H  2.906763 -1.945682 0.731905
H  3.254716 2.205847 -0.529681
H  4.319019 0.107466 0.37957
H  -3.687983 -1.397969 -1.091763
H  -3.251204 -1.838035 0.505004
