program: Gaussian 09
title: 000211732
version: EM64L-G09RevD.01
frameworkgroup: C1[X(C12H13NO3S2)]
method: RPBEPBE
basis: SDD
operation: Freq
keyword: #p
keyword: freq=noraman
keyword: PBEPBE/SDD
title: #p freq=noraman PBEPBE/SDD
converged: YES YES NO NO
title: Mulliken charges:
elementType: S S O O O N C C C C C C C C C C C C H H H H H H H H H H H H H
charge: 0.317197 0.119044 -0.305316 -0.297935 -0.211249 -0.027041 -0.606626 0.559976 0.324407 -0.514227 -0.787214 -0.394733 -0.527325 0.220549 0.188328 -0.342241 -0.529187 -0.530663 0.259224 0.258915 0.286953 0.305628 0.305269 0.258724 0.251707 0.251381 0.223766 0.231499 0.256314 0.224157 0.230718
chargesum: 0.00000
title: Mulliken charges with hydrogens summed into heavy atoms:
elementType: S S O O O N C C C C C C C C C C C C
charge: 0.317197 0.119044 -0.305316 -0.297935 -0.211249 -0.027041 -0.088488 0.559976 0.324407 -0.227273 -0.176317 -0.136009 -0.527325 0.220549 0.188328 -0.090534 0.177459 0.180527
polarizability: 2.19241920e+02 -8.74345744e+00 2.07769922e+02 -3.67640763e+00 1.59709616e+00 1.15161981e+02
1716.lowfreq: -9.3505 0.0009 0.0023 0.0029 3.4564 8.5546 15.7681 35.1020 46.7561
frequency: 13.5655 35.0884 46.7534 67.1464 92.7271 104.4291 116.9524 122.3720 150.5205 156.3611 164.3355 189.0824 220.8561 254.1713 260.1766 305.2208 346.7856 354.7865 369.5339 395.2023 426.5168 467.7029 492.7216 508.7614 514.6968 527.4818 570.5807 583.7453 598.6079 670.5273 707.5227 720.5190 734.0114 757.2487 809.9100 847.0750 877.9557 890.7283 915.2177 927.1476 946.1772 963.8035 979.2949 1006.1600 1061.3351 1094.2000 1113.5150 1114.8783 1117.4582 1139.7803 1153.8885 1156.5794 1192.4897 1197.5728 1222.7829 1245.1171 1261.7634 1266.7797 1332.0464 1369.0633 1372.8805 1404.6630 1421.4603 1424.0776 1444.1650 1452.4674 1457.6217 1459.7770 1476.6933 1484.8186 1488.1671 1573.4325 1611.3087 1632.9470 2971.3166 2974.5377 3032.6289 3049.3324 3067.0408 3071.7010 3097.1560 3121.7505 3122.0939 3123.1817 3141.4715 3157.2075 3165.8493
redmass: 5.9054 5.7883 7.0759 4.8198 7.0034 3.3295 3.2242 3.0625 4.5914 1.2432 1.1065 3.2738 4.3126 8.7665 7.0275 8.1092 4.2847 2.6842 4.7372 16.9521 3.9182 6.8443 3.5919 15.5813 7.7543 4.3087 5.0580 4.3112 4.6494 5.6175 5.9300 5.6382 3.9190 3.7553 3.8409 1.5755 4.0291 1.6793 2.3589 2.0467 7.3894 1.3883 4.3410 2.9234 9.5500 2.7493 1.2416 1.2435 1.1655 1.5251 1.3248 1.5132 1.9822 1.9405 1.4890 2.5226 2.8375 2.5852 2.4509 1.4717 4.3097 1.9565 1.0812 1.1818 1.4184 1.1157 1.0542 1.0692 1.0739 2.6683 1.0547 7.2169 6.5698 11.6012 1.0307 1.0310 1.0588 1.0570 1.1044 1.1037 1.1052 1.1025 1.1067 1.1030 1.0891 1.0924 1.0965
irintensity: 0.1251 0.6069 0.3300 4.2756 3.2882 7.7454 1.8893 8.6359 2.0393 0.3835 0.0387 4.0971 6.7131 4.0096 9.6970 1.3435 0.8184 2.0851 1.4821 6.6083 3.5914 27.6919 11.7365 1.9682 19.2962 4.1496 10.7840 14.2490 1.1844 26.4255 8.5439 14.3602 11.5098 8.8028 4.7782 29.5514 8.0062 11.2944 5.2823 64.9872 66.5366 4.5723 26.9420 46.1020 25.4525 84.7812 14.9987 2.8840 0.2962 1.3073 1.4888 8.1918 136.0856 117.1947 91.6703 163.2383 147.0881 22.3631 234.0728 19.1791 17.4755 5.8553 12.8591 0.7112 15.2680 39.4195 15.4836 7.4656 8.5598 130.6470 26.6349 11.9344 6.1966 211.0265 72.8639 70.2868 13.3171 3.7211 28.9423 23.2444 0.8537 23.4254 0.0589 22.9570 2.1402 0.2200 5.3415
temp: 298.150 k
press: 1.00000 atm
elementType: 16 16 8 8 8 7 6 6 6 6 6 6 6 6 6 6 6 6 1 1 1 1 1 1 1 1 1 1 1 1 1
symmnumber: 1
zpe: 604408.3 jmol-1
zpe.correction: 0.230207 hartree
zpe.thermalcorrener: 0.248401 hartree
zpe.thermalcorrenthalpy: 0.249345 hartree
zpe.thermalcorrgfe: 0.181586 hartree
zpe.sumelectzpe: -1540.274199 hartree
zpe.sumelectthermal: -1540.256004 hartree
zpe.sumelectthermalent: -1540.255060 hartree
zpe.sumelectthermalfe: -1540.322820 hartree
dipole: -1.1622 1.8386 -0.4198
dipole: 2.2153
quadrupole: -109.1099 -120.9512 -120.9143
quadrupole: 10.3716 1.9332 -9.9018
quadrupole: 7.8819 -3.9594 -3.9225 10.3716 1.9332 -9.9018
hfenergy: -1540.5044056 hartree
pointgroup: C01 [X(C12H13N1O3S2)]
dipole: -0.3107459 -0.8063842 0.1130808 debye
polarizability: 215.564752|10.030294|210.7500989|3.8072656|8.5264074|115.8589725 unknown
InChI: InChI=1S/C12H13NO3S2/c1-15-9-4-3-8(5-10(9)16-2)6-13-11(14)7-18-12(13)17/h3-5H,6-7H2,1-2H3
charge 0 multiplicity 1
31 atoms
S  4.471894 0.566437 1.236957
S  2.957023 3.057855 0.239515
O  -2.64889 -1.943353 -0.397362
O  -3.874136 0.333405 0.984741
O  2.322048 -1.837627 -1.096419
N  2.482477 0.444535 -0.530575
C  1.350359 0.821333 -1.437038
C  -0.018021 0.676451 -0.783025
C  2.860728 -0.917093 -0.434538
C  -0.719029 -0.552223 -0.863844
C  3.998741 -1.129067 0.559894
C  -0.610818 1.766682 -0.09573
C  3.188529 1.391331 0.223389
C  -1.991155 -0.696198 -0.274137
C  -2.600131 0.415575 0.379593
C  -1.892383 1.633178 0.478824
C  -2.886398 -2.640812 0.888511
C  -4.990171 0.023501 0.058614
H  1.436161 0.156561 -2.313444
H  1.538579 1.864851 -1.73999
H  -0.275538 -1.418443 -1.365959
H  3.662718 -1.78157 1.380982
H  4.861789 -1.587996 0.053353
H  -0.070524 2.716194 -0.018644
H  -2.374368 2.468219 0.99706
H  -3.485104 -2.014774 1.574909
H  -1.920679 -2.899396 1.362524
H  -3.432669 -3.559533 0.626412
H  -4.807761 -0.922719 -0.481268
H  -5.118907 0.849831 -0.665728
H  -5.882964 -0.058132 0.696823
