program: Gaussian 09
title: 000211727
version: EM64L-G09RevD.01
frameworkgroup: C1[X(C12H12BrNOS2)]
method: RPBEPBE
basis: SDD
operation: Freq
keyword: #p
keyword: freq=noraman
keyword: PBEPBE/SDD
title: #p freq=noraman PBEPBE/SDD
converged: YES YES NO NO
title: Mulliken charges:
elementType: Br S S O N C C C C C C C C C C C C H H H H H H H H H H H H
charge: 0.025512 0.317816 0.160224 -0.178875 -0.193885 -0.619157 -0.312874 0.258026 -0.339805 -0.605956 0.500993 -0.691317 -0.326711 -0.317231 -0.162334 -0.160218 -0.227927 0.304476 0.224967 0.242103 0.198072 0.211873 0.214341 0.216377 0.223974 0.256109 0.270087 0.255501 0.255841
chargesum: 0.00000
title: Mulliken charges with hydrogens summed into heavy atoms:
elementType: Br S S O N C C C C C C C C C C C C
charge: 0.025512 0.317816 0.160224 -0.178875 -0.193885 -0.314681 0.154196 0.258026 0.070141 -0.605956 0.500993 -0.036626 -0.070602 -0.047144 0.093167 0.095622 -0.227927
polarizability: 2.86725057e+02 6.87720824e+00 1.71859266e+02 7.74184405e+00 1.77060747e+01 1.26352815e+02
1716.lowfreq: -9.3113 -4.1683 -0.0022 -0.0017 -0.0013 2.1115 22.9219 31.4969 41.8993
frequency: 22.8706 31.4948 41.8752 54.0938 78.9378 92.0895 109.1039 130.9154 146.9164 165.0497 232.0514 239.5033 251.7996 273.4739 292.1756 335.7931 383.4147 386.3361 397.6978 408.4515 426.2785 491.6171 505.1335 539.1449 576.6106 623.3329 659.5602 676.4338 702.7652 727.0984 751.3642 782.7679 820.2736 827.1289 880.4799 901.7264 935.9098 955.0176 964.1030 994.2561 1012.9595 1027.4794 1059.5469 1064.7851 1084.3127 1108.1792 1110.6623 1159.3201 1185.2358 1189.3000 1217.2772 1222.8411 1262.3464 1288.8965 1291.8301 1300.9207 1310.1818 1352.5322 1372.1035 1392.5073 1394.2537 1453.3312 1471.5155 1472.1032 1479.5696 1485.5218 1587.1154 1594.8175 1636.3321 2968.8330 2979.5770 2985.9896 3014.7010 3033.0413 3055.1877 3076.8971 3081.4522 3162.7265 3163.1768 3180.1645 3183.8557
redmass: 5.3918 5.5261 5.4719 8.3919 4.9453 1.7942 8.2037 3.8065 8.4134 9.1490 6.0355 1.8786 1.8336 8.2272 3.6729 6.9640 8.0815 4.8303 13.0463 2.8617 5.1365 5.9934 5.5504 7.3316 5.6350 7.0326 6.9899 3.0440 4.3445 5.2655 1.2769 4.3189 1.2558 1.6763 1.2819 1.8888 3.0990 1.7228 1.3837 5.6307 7.9560 3.0999 2.4694 1.7355 2.0617 2.0000 1.3837 3.7812 1.1805 1.4316 4.9442 1.4804 1.2524 1.1399 1.3074 5.3846 1.2698 1.5299 7.1769 3.3544 1.2087 1.0756 2.4022 1.0771 1.0417 1.0705 7.9095 6.4147 12.5337 1.0594 1.0363 1.0590 1.0998 1.0866 1.1015 1.1010 1.0994 1.0891 1.0890 1.0973 1.0983
irintensity: 0.3720 0.0875 0.5410 0.3189 0.1207 0.0555 1.3668 3.5755 0.8195 0.3841 0.1476 1.5961 2.0307 1.7438 2.5169 5.4352 19.0152 6.6581 1.3577 0.8987 7.5783 7.3238 7.5586 5.4743 23.5232 1.1239 3.0265 0.7176 4.6427 8.9291 13.4689 65.5351 1.1140 38.0184 1.8620 3.8089 7.8897 5.3235 0.5655 32.8478 72.0944 12.9971 37.8941 0.6653 3.7312 29.3861 7.6646 53.2695 10.4698 2.0671 414.3743 57.5311 27.1592 1.2101 14.6875 138.5869 0.8929 0.4257 2.7244 7.6365 11.9758 3.9681 143.5962 6.4850 14.3480 15.4977 2.3595 16.1620 181.1565 20.6205 31.4556 23.7685 7.4301 1.2359 11.9728 61.9271 42.8258 2.0037 3.2700 3.2446 0.3677
temp: 298.150 k
press: 1.00000 atm
elementType: 35 16 16 8 7 6 6 6 6 6 6 6 6 6 6 6 6 1 1 1 1 1 1 1 1 1 1 1 1
symmnumber: 1
zpe: 557988.7 jmol-1
zpe.correction: 0.212527 hartree
zpe.thermalcorrener: 0.229749 hartree
zpe.thermalcorrenthalpy: 0.230693 hartree
zpe.thermalcorrgfe: 0.164044 hartree
zpe.sumelectzpe: -1402.813154 hartree
zpe.sumelectthermal: -1402.795931 hartree
zpe.sumelectthermalent: -1402.794987 hartree
zpe.sumelectthermalfe: -1402.861636 hartree
dipole: -2.8492 -1.6700 -0.0028
dipole: 3.3026
quadrupole: -113.8425 -140.0578 -115.8177
quadrupole: 6.9028 0.1817 1.5172
quadrupole: 9.3969 -16.8185 7.4216 6.9028 0.1817 1.5172
hfenergy: -1403.0256804 hartree
pointgroup: C01 [X(C12H12Br1N1O1S2)]
dipole: 1.1813526 0.5351219 0.0793556 debye
polarizability: 285.6469332|-1.369026|176.936612|-18.0259591|-3.7827528|122.3535931 unknown
InChI: InChI=1S/C12H12BrNOS2/c1-2-3-10-11(15)14(12(16)17-10)9-6-4-8(13)5-7-9/h4-7,10H,2-3H2,1H3
charge 0 multiplicity 1
29 atoms
Br -5.844769 0.870101 0.726166
S  2.417673 -1.621113 -0.937942
S  -0.272878 -3.077808 -0.661967
O  0.745104 1.941637 -0.371432
N  0.133347 -0.342977 -0.434871
C  2.498379 0.272081 -0.762799
C  3.459146 0.727087 0.357974
C  1.063171 0.738126 -0.512082
C  4.938617 0.408861 0.050974
C  0.617851 -1.654011 -0.645396
C  -1.267395 -0.071743 -0.166562
C  5.880432 0.894473 1.172887
C  -1.997472 0.745392 -1.055543
C  -1.877432 -0.606344 0.988901
C  -3.35482 1.029823 -0.792704
C  -3.234854 -0.330353 1.25624
C  -3.95725 0.484684 0.359621
H  2.833171 0.675029 -1.735936
H  3.158213 0.254686 1.312898
H  3.32755 1.821024 0.477178
H  5.223382 0.887506 -0.908158
H  5.063508 -0.683718 -0.089759
H  5.793433 1.986946 1.321299
H  5.640823 0.403317 2.134212
H  6.935003 0.669236 0.933088
H  -1.514902 1.164065 -1.943056
H  -1.303826 -1.237365 1.673093
H  -3.927542 1.662625 -1.475706
H  -3.716362 -0.742969 2.146683
