program: Gaussian 09
title: 000217147
version: EM64L-G09RevD.01
frameworkgroup: C1[X(C16H19N3O4)]
method: RPBEPBE
basis: SDD
operation: Freq
keyword: #p
keyword: freq=noraman
keyword: PBEPBE/SDD
title: #p freq=noraman PBEPBE/SDD
converged: YES YES NO NO
title: Mulliken charges:
elementType: O O O O N N N C C C C C C C C C C C C C C C C H H H H H H H H H H H H H H H H H H H
charge: -0.288935 -0.247792 -0.265384 -0.266664 -0.226347 -0.144101 -0.297108 -0.257642 -0.451219 -0.549199 0.217853 0.149519 -0.345057 -0.333090 -0.410422 -0.403903 0.472894 -0.459885 -0.357645 0.213453 0.170150 -0.356423 -0.202609 0.254166 0.292494 0.232595 0.263353 0.246990 0.228068 0.260551 0.217063 0.232728 0.199278 0.222890 0.221849 0.188145 0.276077 0.327497 0.254900 0.249464 0.235323 0.236121
chargesum: 0.00000
title: Mulliken charges with hydrogens summed into heavy atoms:
elementType: O O O O N N N C C C C C C C C C C C C C C C C
charge: -0.288935 -0.247792 -0.265384 -0.266664 -0.226347 -0.144101 -0.021031 -0.003476 0.073871 -0.038856 0.217853 0.149519 0.143562 0.116701 0.011746 0.006092 0.472894 -0.132387 -0.102745 0.213453 0.170150 -0.106959 0.268835
polarizability: 3.18943397e+02 9.12133840e+00 1.90052728e+02 -5.22549969e+00 -5.98402580e-01 1.27905340e+02
1716.lowfreq: -62.9764 -5.4864 -2.1134 -0.0011 -0.0005 0.0009 10.0207 15.3359 27.3321
frequency: -62.9760 15.0302 27.3103 48.4136 58.3116 67.8997 86.3752 106.6171 135.8037 161.9499 185.6005 200.5034 212.4623 250.8052 278.2024 287.9746 301.6129 347.6542 357.1457 363.6589 407.3899 418.3676 426.8743 430.4234 452.1153 497.1065 524.7322 554.0953 580.2395 599.9135 614.6860 635.5217 644.3350 664.7783 679.8647 698.9767 707.8391 715.1997 776.8461 786.3338 795.9194 834.0937 837.5265 855.8028 857.3037 890.0717 901.7378 912.3933 924.0068 938.2558 951.4794 980.8489 985.2919 1036.4219 1048.8102 1050.4923 1053.4567 1060.4957 1066.0733 1093.3911 1108.7885 1113.4607 1119.8129 1145.4178 1151.3900 1152.3911 1167.9630 1196.1171 1200.0773 1209.3678 1217.9993 1223.9447 1247.3102 1259.6014 1269.1596 1278.0524 1287.7407 1305.0425 1321.1890 1331.5065 1338.2056 1354.6667 1362.2192 1368.6374 1382.1121 1396.9647 1422.9561 1444.0731 1450.1109 1454.9449 1457.0497 1459.7153 1463.7660 1469.2982 1479.7148 1488.0546 1501.5000 1574.4574 1611.1516 1624.7134 1633.4312 2864.4663 2880.8216 2980.8908 2989.6835 2998.1885 3005.6685 3009.3878 3016.2847 3045.3092 3050.3983 3064.6785 3087.5936 3088.3331 3100.0587 3104.3322 3168.6190 3187.4602 3201.3979 3474.7468
redmass: 2.3251 5.5439 5.1643 3.9745 6.1134 4.7405 6.6737 4.2021 5.2599 3.5170 5.7677 3.2195 5.5260 5.4902 2.4825 2.8597 5.8700 3.8813 6.0497 4.2167 2.2497 3.9174 4.2523 3.4949 3.0147 2.1552 3.1230 3.6796 5.3733 3.2429 3.9426 4.1932 7.3974 1.6598 9.5095 5.7025 4.8743 5.4534 6.1150 4.9365 1.4503 6.6577 1.5491 6.1905 3.6807 2.4519 1.3611 1.3437 2.1227 2.0223 3.6750 4.6636 2.4649 2.1670 1.7875 1.9206 3.1466 1.9866 1.4605 2.6618 3.2102 3.2246 1.0457 1.4140 2.7639 1.3350 2.6701 1.1050 1.3153 2.1754 3.0303 1.4759 1.6264 1.5094 1.8833 1.2718 1.3148 1.4654 1.2607 1.2900 1.5923 1.3952 1.9228 1.6702 1.5062 4.2555 2.7945 1.3407 1.1116 4.2321 1.0794 1.0770 1.1164 1.1067 2.0340 1.3962 1.1102 7.7423 8.1299 10.6536 8.2047 1.0708 1.0701 1.0683 1.0662 1.0583 1.0671 1.0538 1.0821 1.0895 1.0911 1.1058 1.1183 1.0986 1.0964 1.0931 1.0880 1.0965 1.0938 1.0757
irintensity: 14.8425 0.6311 0.8058 0.7503 2.2484 0.5672 0.5289 4.8450 2.2648 0.5503 1.9299 5.9060 0.2384 0.5161 8.5771 2.2148 2.4627 5.7482 3.7343 29.0658 1.2934 8.8805 3.3167 3.7646 3.8427 56.6372 66.6574 2.4089 1.1636 10.8260 4.3647 6.8886 7.7731 70.3955 1.9805 6.3016 1.3706 8.8474 17.0144 5.7820 47.5958 34.4410 0.0073 2.4357 1.8642 6.8968 28.1126 10.5721 0.7848 5.3395 8.7313 140.8849 24.7238 36.6805 17.7812 37.1413 4.0759 3.8911 4.6668 36.9794 11.8515 19.0390 0.3311 22.0581 23.4209 4.7630 12.1341 3.0524 20.7576 148.5427 335.0438 96.9591 17.6078 37.9924 52.7533 5.1966 29.9262 12.6122 35.1863 8.6106 31.9134 4.5537 32.3696 23.1684 3.2240 36.4715 135.9198 8.4727 12.0381 57.7386 10.0464 0.7172 25.5162 1.7583 310.2769 106.3095 2.8227 262.9091 3.4427 267.8035 55.7412 81.6779 100.2666 26.5593 46.7848 18.6374 7.8367 145.6230 14.3981 45.4705 48.5368 17.1835 34.5253 16.7294 8.4099 26.1727 9.1279 3.6558 19.2084 0.1244
temp: 298.150 k
press: 1.00000 atm
elementType: 8 8 8 8 7 7 7 6 6 6 6 6 6 6 6 6 6 6 6 6 6 6 6 1 1 1 1 1 1 1 1 1 1 1 1 1 1 1 1 1 1 1
symmnumber: 1
zpe: 883712.8 jmol-1
zpe.correction: 0.336588 hartree
zpe.thermalcorrener: 0.355911 hartree
zpe.thermalcorrenthalpy: 0.356855 hartree
zpe.thermalcorrgfe: 0.286805 hartree
zpe.sumelectzpe: -1084.534937 hartree
zpe.sumelectthermal: -1084.515614 hartree
zpe.sumelectthermalent: -1084.514670 hartree
zpe.sumelectthermalfe: -1084.584720 hartree
dipole: 4.6668 -1.1472 3.5766
dipole: 5.9906
quadrupole: -100.7407 -145.8829 -135.0322
quadrupole: 4.9013 9.4718 0.1058
quadrupole: 26.4779 -18.6643 -7.8136 4.9013 9.4718 0.1058
hfenergy: -1084.871525 hartree
pointgroup: C01 [X(C16H19N3O4)]
dipole: -1.8628789 -0.5144899 -1.3490416 debye
polarizability: 318.898543|-4.1963672|189.5444726|-11.5109191|0.7901289|128.4584489 unknown
InChI: InChI=1S/C16H19N3O4/c20-15-7-11(16(21)18-5-3-17-4-6-18)9-19(15)12-1-2-13-14(8-12)23-10-22-13/h1-2,8,11,17H,3-7,9-10H2
charge 0 multiplicity 1
42 atoms
O  -2.558889 -1.693227 1.386633
O  0.894204 2.595342 0.701182
O  5.586708 1.366289 -0.385533
O  6.186941 -0.943855 -0.686546
N  0.743242 0.289741 0.099128
N  -4.0931 -0.271002 0.373061
N  -6.704879 -0.157886 -0.751106
C  -1.642957 0.070388 -0.046313
C  -0.322498 -0.740264 -0.018351
C  -1.278196 1.386504 0.695266
C  -2.796628 -0.705185 0.616638
C  0.236574 1.535532 0.501244
C  -5.227117 -0.94876 1.050452
C  -4.498649 0.886107 -0.455701
C  -6.296317 -1.354853 0.016933
C  -5.576232 0.456206 -1.477468
C  2.116887 -0.053239 -0.090605
C  3.123258 0.966345 -0.115063
C  2.474314 -1.420531 -0.26164
C  4.433751 0.543088 -0.316079
C  4.787923 -0.810617 -0.492513
C  3.822319 -1.81618 -0.467451
C  6.731135 0.437356 -0.577995
H  -1.88662 0.307873 -1.097638
H  -0.321385 -1.430162 0.84567
H  -0.184995 -1.328506 -0.942214
H  -1.480894 1.309243 1.780778
H  -1.798311 2.283119 0.32163
H  -5.677574 -0.249673 1.782578
H  -4.823192 -1.823408 1.583955
H  -3.630892 1.313066 -0.979786
H  -4.929586 1.668016 0.201622
H  -5.875024 -2.163029 -0.63019
H  -7.175604 -1.762236 0.5473
H  -5.934857 1.348194 -2.022507
H  -5.102305 -0.237864 -2.216711
H  -7.529234 -0.31514 -1.342255
H  2.861496 2.013992 0.034564
H  1.711036 -2.200656 -0.217981
H  4.088903 -2.867952 -0.595497
H  7.392316 0.4939 0.304924
H  7.247424 0.69412 -1.518616
