program: Gaussian 09
title: 000211723
version: EM64L-G09RevD.01
frameworkgroup: C1[X(C11H10ClNOS2)]
method: RPBEPBE
basis: SDD
operation: Freq
keyword: #p
keyword: freq=noraman
keyword: PBEPBE/SDD
title: #p freq=noraman PBEPBE/SDD
converged: NO YES NO NO
title: Mulliken charges:
elementType: Cl S S O N C C C C C C C C C C C H H H H H H H H H H
charge: -0.050501 0.313132 0.165207 -0.178435 -0.202501 -0.585572 -0.319002 0.263969 0.520641 -0.602403 -0.677891 -0.309001 -0.348144 -0.062821 -0.191380 -0.231285 0.303573 0.229626 0.246659 0.227685 0.213685 0.232205 0.288278 0.253846 0.239059 0.261371
chargesum: 0.00000
title: Mulliken charges with hydrogens summed into heavy atoms:
elementType: Cl S S O N C C C C C C C C C C C
charge: -0.050501 0.313132 0.165207 -0.178435 -0.202501 -0.281999 0.157283 0.263969 0.520641 -0.602403 -0.004316 -0.020723 -0.094298 -0.062821 0.047679 0.030086
polarizability: 2.29684572e+02 1.30109566e+01 1.65389221e+02 -1.51582391e+00 1.01704827e+01 1.23546967e+02
1716.lowfreq: -8.0480 -2.8826 -0.0007 0.0017 0.0021 4.8379 23.2126 37.8396 57.8243
frequency: 23.1686 37.8062 57.8146 67.2748 102.0968 107.2112 161.7175 183.4865 211.1573 227.1738 233.8345 268.7340 292.1871 322.3345 354.5604 382.6586 402.8955 429.8685 438.7540 492.3217 517.5136 530.8148 579.1678 633.5999 671.8813 674.9609 686.2898 728.5242 785.7681 802.7916 824.0081 880.1228 893.4934 906.8071 968.4676 977.8807 986.4243 1014.4386 1048.0736 1071.2075 1080.5703 1092.2574 1096.2280 1161.4903 1177.1270 1191.1058 1220.1494 1240.0634 1275.9474 1283.0108 1305.8336 1337.9493 1381.9384 1396.9641 1422.4696 1460.1347 1463.4957 1476.4113 1483.8892 1586.9151 1601.9817 1638.9081 2982.3751 2994.8203 3034.7661 3053.4984 3081.5070 3087.7735 3151.7668 3172.6307 3181.9969 3184.9666
redmass: 7.6863 5.5082 8.4990 6.9164 2.4758 12.3395 2.9508 5.1490 7.7821 1.3149 6.9349 3.9022 5.6187 10.9434 3.2638 10.1177 10.8986 6.6866 3.1135 10.7605 6.2585 8.3386 7.1049 6.2848 3.1411 6.8733 2.5242 5.2734 1.5682 1.7182 2.7640 1.6021 1.9135 1.4657 3.9863 1.4899 5.7998 7.6500 1.5490 2.0485 1.9396 1.6754 2.2258 4.3435 1.0955 1.3728 7.0656 1.3321 1.5457 1.1694 3.4227 1.3905 10.5382 1.2091 2.8313 1.0725 2.5172 1.0482 1.0474 7.1033 6.9829 12.4277 1.0365 1.0598 1.0867 1.0986 1.1015 1.0990 1.0876 1.0932 1.0966 1.0967
irintensity: 0.5310 1.2256 0.4559 0.8722 0.3315 1.8739 1.3123 0.1708 3.0001 1.0866 1.6077 1.3394 5.1187 2.3174 1.9418 5.7662 3.6920 3.4639 4.4038 5.8249 8.1724 5.6461 8.8920 9.9202 8.8586 34.3334 18.8464 39.2615 19.2649 20.4736 16.0479 14.7334 3.7668 7.8513 4.4811 0.5225 3.8335 56.6765 1.3644 20.1728 13.3546 18.5193 4.5035 116.7371 3.2781 3.7545 450.4595 7.8893 25.6214 17.3950 100.2397 3.8590 1.7300 17.7793 16.9640 7.4273 70.4643 13.3509 13.8164 50.3648 32.2407 198.2557 25.6490 10.7557 1.1650 0.9524 42.5163 33.5634 5.8819 3.0821 2.0817 3.5728
temp: 298.150 k
press: 1.00000 atm
elementType: 17 16 16 8 7 6 6 6 6 6 6 6 6 6 6 6 1 1 1 1 1 1 1 1 1 1
symmnumber: 1
zpe: 486163.8 jmol-1
zpe.correction: 0.185170 hartree
zpe.thermalcorrener: 0.200735 hartree
zpe.thermalcorrenthalpy: 0.201679 hartree
zpe.thermalcorrgfe: 0.140062 hartree
zpe.sumelectzpe: -1810.190010 hartree
zpe.sumelectthermal: -1810.174445 hartree
zpe.sumelectthermalent: -1810.173501 hartree
zpe.sumelectthermalfe: -1810.235118 hartree
dipole: -2.1096 -2.3479 -0.6536
dipole: 3.2234
quadrupole: -102.0375 -128.0643 -110.3563
quadrupole: -0.3712 -8.1524 5.6378
quadrupole: 11.4486 -14.5783 3.1297 -0.3712 -8.1524 5.6378
hfenergy: -1810.3751801 hartree
pointgroup: C01 [X(C11H10Cl1N1O1S2)]
dipole: 0.8361713 -0.9410196 0.1536824 debye
dipolederiv: -0.389837 0.1340903 -0.269077 0.2071181 -0.2172983 0.250512 -0.3377745 0.2084285 -0.4185563 -0.7119002 0.1048059 0.0335675 0.0857998 -0.0907171 -0.0656308 0.0431043 -0.0257791 -0.0212119 -0.5658679 0.3092536 0.1330386 0.3148888 -0.563536 -0.1919123 0.0583261 -0.1618349 -0.1459826 -0.4954446 -0.1446615 -0.0494118 0.1567489 -1.0842443 -0.2308663 0.0844881 -0.2512065 -0.3561368 -1.0173858 0.3121461 0.0807089 0.01736 -1.4168345 -0.4545952 -0.0461352 -0.408548 -0.2065954 -0.4433018 -0.1719987 -0.0140867 -0.1764976 0.2884395 0.0970963 -0.0227448 0.0491297 0.1435783 0.1437137 -0.0378723 -0.0438824 0.0342287 -0.0048811 -0.0839794 -0.1684979 -0.0129662 0.1026074 1.0343589 -0.3191917 -0.1255778 -0.5384389 1.3427135 0.3324346 -0.0638603 0.3671306 0.2517938 0.7341848 0.2394166 0.1364293 0.1469356 0.0931174 -0.1249824 0.1304238 -0.0454079 0.2060512 1.3654875 -0.2543208 -0.0923475 -0.1249883 1.339477 0.5992632 -0.0296743 0.458484 -0.0120212 -0.0562583 -0.0451925 0.0194558 -0.0395627 0.0817498 -0.0110079 0.0992389 -0.0261139 0.0353692 -0.2989342 0.0758924 -0.1635274 0.0971 -0.0492174 0.0688133 -0.087254 0.1081189 -0.1765739 -0.1142952 -0.091553 0.0536881 -0.0581214 -0.0759921 -0.0274684 -0.0506098 -0.0359525 -0.0840875 0.5231769 -0.2741739 0.474276 -0.3196039 0.2427878 -0.43832 0.5392672 -0.3834183 0.5605195 0.0300978 0.0612541 0.0041108 0.0596226 0.012306 -0.1137157 -0.0156133 -0.1068887 -0.0231406 -0.0687126 0.0722408 -0.0660982 0.0911369 -0.1401038 0.0770329 -0.0773226 0.0565389 -0.2100222 0.0634846 0.025553 -0.0402042 0.060456 -0.0313468 0.0186457 -0.0062003 0.0154941 0.0094303 -0.0159018 0.0516606 -0.0732968 0.0283107 0.0384522 0.102058 -0.0574834 0.0560502 -0.0225139 0.0302577 -0.0178256 0.0223956 -0.0059679 -0.0730089 -0.0609696 0.0571114 -0.0633523 0.0498177 0.1129124 0.020759 -0.0029888 -0.0207546 -0.114228 -0.062137 -0.0470588 -0.0656411 0.0798739 0.029378 0.0215869 -0.0537613 0.0687403 0.0048271 0.1045657 -0.122276 0.1062761 -0.0366585 -0.0467146 0.0127989 0.1045401 0.0238451 0.1038499 -0.0293183 0.1544759 -0.0283515 -0.0788726 0.1006988 -0.0292805 0.023558 -0.0497255 0.0623288 0.048697 0.0464606 0.0336991 0.1041714 0.0485757 0.0480625 -0.0762825 0.0429069 0.1014665 0.0632284 -0.0694494 0.0331625 0.0594626 0.0380285 -0.0594386 0.0154303 -0.0687644 0.0244737 0.1053256 0.0232415 0.1038702 0.058497 -0.0298013 -0.0440114 -0.0306566 -0.032773 0.1254193 0.0272308 -0.0341832 0.0190783 0.1312009 unknown
polarizability: 229.3588255|-10.9662809|167.2549223|10.3142603|-1.3812298|122.0070133 unknown
InChI: InChI=1S/C11H10ClNOS2/c1-2-9-10(14)13(11(15)16-9)8-5-3-4-7(12)6-8/h3-6,9H,2H2,1H3
charge 0 multiplicity 1
26 atoms
Cl -4.058091 0.923028 -2.107233
S  2.685143 1.427423 0.963262
S  -0.114359 2.652675 1.290279
O  1.201287 -2.084579 -0.168061
N  0.449479 0.07269 0.447835
C  2.872407 -0.372294 0.37435
C  3.70565 -0.492633 -0.922765
C  1.45213 -0.911505 0.191269
C  -0.952675 -0.265525 0.279228
C  0.864748 1.353666 0.876413
C  5.175786 -0.0749 -0.727122
C  -1.711705 0.415397 -0.69831
C  -1.522515 -1.2822 1.074435
C  -3.061507 0.056224 -0.853293
C  -2.880341 -1.620679 0.889098
C  -3.665741 -0.951344 -0.076358
H  3.359897 -0.934408 1.191184
H  3.234264 0.11861 -1.715005
H  3.647606 -1.549881 -1.246955
H  5.258066 0.985802 -0.426705
H  5.667611 -0.690821 0.048607
H  5.741081 -0.201683 -1.666945
H  -1.262852 1.201673 -1.309629
H  -0.913793 -1.802432 1.818818
H  -3.333592 -2.408115 1.499151
H  -4.719081 -1.20649 -0.221545
