program: Gaussian 09
title: 000211722
version: EM64L-G09RevD.01
frameworkgroup: C1[X(C11H10ClNOS2)]
method: RPBEPBE
basis: SDD
operation: Freq
keyword: #p
keyword: freq=noraman
keyword: PBEPBE/SDD
title: #p freq=noraman PBEPBE/SDD
converged: YES YES NO NO
title: Mulliken charges:
elementType: Cl S S O N C C C C C C C C C C C H H H H H H H H H H
charge: -0.027480 0.305122 0.150303 -0.176597 -0.199540 -0.579856 -0.318853 0.275842 0.601742 -0.580899 -0.678614 -0.258990 -0.296050 -0.227559 -0.219281 -0.215330 0.301335 0.234779 0.244505 0.228149 0.212249 0.231459 0.256823 0.259040 0.238540 0.239159
chargesum: 0.00000
title: Mulliken charges with hydrogens summed into heavy atoms:
elementType: Cl S S O N C C C C C C C C C C C
charge: -0.027480 0.305122 0.150303 -0.176597 -0.199540 -0.278520 0.160432 0.275842 0.601742 -0.580899 -0.006758 -0.258990 -0.039227 0.031481 0.019259 0.023829
polarizability: 2.17081454e+02 1.68372869e+01 1.59940276e+02 -3.39706318e+00 4.38993406e+00 1.29282291e+02
1716.lowfreq: -9.7009 -2.9126 -0.0026 -0.0017 -0.0011 5.2171 20.3612 33.8649 57.7079
frequency: 20.3488 33.8012 57.7013 66.5518 94.9961 100.8386 146.0218 160.3547 198.7711 221.4773 261.5466 264.5568 289.0900 322.6474 351.6103 394.0365 403.9347 446.9094 455.6956 492.3183 512.3185 538.4140 575.1586 626.1465 669.5707 672.5407 696.6311 737.6434 764.9228 790.5610 813.6548 865.1876 890.6861 948.9305 965.6891 990.1676 1008.4563 1025.9018 1045.6734 1046.4899 1079.0697 1093.6715 1125.0383 1169.2007 1176.2525 1190.4737 1229.1995 1238.3915 1258.1922 1281.5114 1314.4766 1337.9603 1375.3019 1395.1662 1428.1327 1458.7269 1467.9543 1474.7605 1482.9431 1584.7786 1601.8889 1643.0767 2980.5622 2995.4272 3041.3148 3056.0969 3080.7357 3085.9278 3144.6212 3157.2920 3170.9791 3180.9862
redmass: 8.4304 5.2431 8.6496 5.9238 6.5479 2.9320 5.5315 3.0682 7.8249 1.3340 8.2934 4.0188 5.9086 9.2641 3.3485 9.9071 10.0818 3.6306 6.9574 9.8739 5.9703 5.3267 7.8373 6.3738 5.4088 3.8491 4.4878 3.0556 1.6002 2.7228 1.7361 1.4194 2.2015 1.5676 3.5970 1.3458 9.0643 3.8831 2.2782 1.8123 1.9257 2.3859 1.6175 1.9677 1.4581 1.3615 5.4664 1.3460 1.6002 1.1668 4.4731 1.3876 11.0898 1.2103 2.2086 1.0728 2.8063 1.0482 1.0472 6.7738 7.3351 12.5368 1.0363 1.0603 1.0899 1.0955 1.1015 1.0989 1.0862 1.0909 1.0956 1.1005
irintensity: 0.5578 1.6346 0.4748 1.7782 0.4303 1.0099 0.6011 1.6175 1.9249 1.3392 2.1197 1.8208 2.4252 2.0033 1.9318 7.9920 0.6306 6.1189 9.8605 3.1681 1.9225 13.0863 6.8291 18.0010 4.9413 10.4993 6.3284 31.9450 34.4944 39.6401 13.7803 1.9610 14.0346 2.7878 4.8976 0.2234 48.8458 15.4154 11.1786 6.2565 12.1518 14.1995 1.1784 50.6522 30.7291 1.6317 419.8751 15.7804 37.9844 20.8732 88.3183 2.2051 1.5684 16.8496 19.4927 8.4645 65.0579 13.1129 13.0126 6.0767 5.2405 198.1477 27.4983 8.8508 1.0035 0.2924 43.1295 32.1812 1.3174 10.4011 5.7108 9.5558
temp: 298.150 k
press: 1.00000 atm
elementType: 17 16 16 8 7 6 6 6 6 6 6 6 6 6 6 6 1 1 1 1 1 1 1 1 1 1
symmnumber: 1
zpe: 486091.0 jmol-1
zpe.correction: 0.185142 hartree
zpe.thermalcorrener: 0.200776 hartree
zpe.thermalcorrenthalpy: 0.201721 hartree
zpe.thermalcorrgfe: 0.139814 hartree
zpe.sumelectzpe: -1810.188739 hartree
zpe.sumelectthermal: -1810.173105 hartree
zpe.sumelectthermalent: -1810.172161 hartree
zpe.sumelectthermalfe: -1810.234068 hartree
dipole: 0.3768 -1.0863 -1.5370
dipole: 1.9195
quadrupole: -89.8574 -125.3372 -115.8597
quadrupole: 3.2630 -0.8033 -9.8641
quadrupole: 20.4940 -14.9858 -5.5083 3.2630 -0.8033 -9.8641
hfenergy: -1810.3738816 hartree
pointgroup: C01 [X(C11H10Cl1N1O1S2)]
dipole: 0.1426034 -0.5974512 -0.4393191 debye
dipolederiv: -0.3187519 -0.058771 0.2842281 -0.0656129 -0.0751341 0.1239138 0.2561107 0.1275964 -0.4590042 -0.6504016 -0.1614487 -0.0779889 -0.1350207 -0.1500304 -0.0069311 -0.0847858 -0.0277516 -0.0092762 -0.5135837 -0.317793 -0.0866432 -0.3056085 -0.669154 -0.1165983 -0.0822187 -0.1449082 -0.1152464 -0.492835 0.2354321 0.0694759 -0.0523953 -1.086055 -0.2542049 -0.0321474 -0.1874205 -0.3442349 -0.800883 -0.2818159 -0.083382 0.0346377 -1.5090874 -0.2894592 -0.0742854 -0.3218848 -0.1396729 -0.4507213 0.0866639 0.0506444 0.0710337 0.3602546 0.0026568 0.093032 0.0533504 0.1179489 0.1325071 0.0696953 -0.0228786 0.0676863 -0.017434 0.013988 -0.1378189 -0.0589107 0.0923674 0.9200589 0.2645515 0.0516685 0.3825327 1.4241996 0.4403177 0.161235 0.3193166 0.2618656 0.5086011 -0.2176197 0.1365985 -0.1289157 0.0403225 -0.0070422 0.067753 0.0163732 -0.0054098 1.2884346 0.2424526 0.1348817 0.1373194 1.4879222 0.3245533 0.1704079 0.3799205 -0.0962305 -0.0537259 0.0218436 0.0333123 -0.0262114 0.0582016 0.0253392 0.0938153 0.0439803 0.0721524 0.3721613 0.1295514 -0.4961832 0.0787079 0.0322654 -0.1872066 -0.2888048 -0.2239018 0.6354523 -0.0423979 -0.00108 0.0109879 -0.0140084 -0.0455283 -0.0459954 -0.0403791 -0.0147251 0.0072505 -0.2277535 -0.0481709 0.1940352 -0.0235115 -0.0815354 -0.021816 0.1230988 -0.0070131 -0.1248741 -0.0501532 0.052623 -0.1367187 0.0326411 -0.1252521 -0.0408188 -0.0857106 -0.0476971 -0.0054744 0.1318136 -0.0418398 0.0118341 -0.0327394 -0.0982837 -0.076284 -0.0321735 -0.0675812 0.0497953 0.0706496 0.0030095 -0.0451844 -0.0460803 -0.0147985 -0.0371333 -0.0349659 -0.0270624 -0.0150644 -0.0000617 -0.0198538 -0.0818976 -0.011646 0.0865075 -0.0429301 -0.0673937 -0.0070099 -0.0646517 0.0276795 0.0171679 0.0257664 -0.0052979 -0.099353 -0.019235 0.055834 -0.0057918 0.0755255 0.1060934 0.0073057 -0.0044852 0.0667504 -0.1197061 -0.0464907 -0.0246995 -0.0435819 0.0871333 0.0264691 -0.0009839 -0.0493676 -0.0096867 0.0811088 -0.0478517 -0.1358985 -0.0587001 -0.1176528 -0.0326499 -0.0672262 0.0742628 -0.0992123 0.024867 0.0971695 0.1158004 0.1024059 -0.0139375 0.0693363 0.0231969 -0.0511302 0.0289799 0.095292 0.0607159 -0.0628905 0.0546861 0.0148115 0.0720103 0.0258553 -0.024865 0.0316861 0.1265817 0.065635 -0.0435512 0.0673481 0.0133388 0.0075913 -0.0050954 0.082258 -0.0180203 0.1361983 0.0579294 0.0943039 0.0520577 -0.0087845 -0.0994876 0.0423497 0.0007706 0.0419922 0.1376306 0.0277786 -0.0036677 0.0269048 0.0918726 unknown
polarizability: 217.7739944|13.9633658|159.0419844|-7.5990914|-5.2587912|129.488042 unknown
InChI: InChI=1S/C11H10ClNOS2/c1-2-9-10(14)13(11(15)16-9)8-6-4-3-5-7(8)12/h3-6,9H,2H2,1H3
charge 0 multiplicity 1
26 atoms
Cl 0.708531 -0.84903 2.345553
S  -2.564586 1.587343 -0.253222
S  0.107082 3.043852 0.256072
O  -0.70798 -1.876299 -0.882052
N  -0.206764 0.362917 -0.328951
C  -2.562705 -0.293022 -0.571964
C  -3.338785 -1.079122 0.510612
C  -1.092381 -0.712956 -0.627033
C  1.214739 0.116891 -0.236633
C  -0.748791 1.645367 -0.100398
C  -4.847322 -0.765151 0.509838
C  1.774336 -0.453365 0.928477
C  2.055525 0.429195 -1.326442
C  3.15397 -0.71543 1.019066
C  3.440508 0.174719 -1.248763
C  3.987167 -0.397479 -0.077155
H  -3.017117 -0.457624 -1.564902
H  -2.897923 -0.861872 1.501208
H  -3.171457 -2.154854 0.307601
H  -5.038386 0.300727 0.732947
H  -5.305243 -0.999012 -0.469502
H  -5.366477 -1.366115 1.277029
H  1.613001 0.872802 -2.223643
H  3.56629 -1.157701 1.930276
H  4.087752 0.420934 -2.096071
H  5.061316 -0.598715 -0.010252
