program: Gaussian 09
title: 000217082
version: EM64L-G09RevD.01
frameworkgroup: C1[X(C9H17N2O2PS4)]
method: RPBEPBE
basis: SDD
operation: Freq
keyword: #p
keyword: freq=noraman
keyword: PBEPBE/SDD
title: #p freq=noraman PBEPBE/SDD
converged: YES YES NO NO
title: Mulliken charges:
elementType: S S S S P O O N N C C C C C C C C C H H H H H H H H H H H H H H H H H
charge: 0.049628 0.288379 -0.209335 0.282497 0.577715 -0.449969 -0.484410 -0.059117 -0.017866 -0.758128 -0.206023 -0.218496 0.016736 -0.667849 -0.650438 -0.456076 -0.567924 -0.662460 0.321559 0.300551 0.224091 0.231096 0.223684 0.236494 0.226801 0.275131 0.202998 0.230578 0.236336 0.211860 0.285948 0.287247 0.232439 0.232887 0.233436
chargesum: 0.00000
title: Mulliken charges with hydrogens summed into heavy atoms:
elementType: S S S S P O O N N C C C C C C C C C
charge: 0.049628 0.288379 -0.209335 0.282497 0.577715 -0.449969 -0.484410 -0.059117 -0.017866 -0.136018 0.249163 0.241682 0.016736 0.037081 0.028336 -0.456076 0.005270 0.036302
polarizability: 3.50329467e+02 2.30623470e+01 1.96483205e+02 2.15278233e+01 -1.94643023e+00 1.68100661e+02
1716.lowfreq: -12.3843 -3.7280 -2.9081 0.0008 0.0011 0.0024 5.4172 18.3786 25.7688
frequency: -10.8362 18.2954 25.7628 34.0340 36.8119 47.1326 63.6702 67.7001 72.8882 75.7166 86.6885 98.7380 108.0108 121.5698 145.8050 156.5239 204.6796 224.2695 233.3581 236.5421 247.7019 254.0869 263.9262 270.9731 297.5126 323.0294 329.1316 352.0134 396.4831 431.5833 444.7427 512.1226 554.2260 561.7302 581.0390 584.0285 611.6311 652.5583 665.1672 679.8381 728.6670 778.8955 807.6668 809.7004 857.5713 858.0797 870.2288 951.5719 984.4296 992.6612 1006.8930 1017.4682 1044.4460 1072.8233 1102.3659 1103.9426 1106.1723 1131.7276 1132.5780 1206.7877 1234.2804 1247.1782 1253.8318 1255.0437 1275.9978 1329.7766 1344.9391 1356.7965 1395.6228 1397.8937 1400.5139 1420.3208 1449.4123 1451.1751 1457.8306 1462.4252 1471.5127 1473.1770 1476.0956 1482.0040 1486.9898 1487.8929 2990.1897 2990.9120 2994.0653 2994.8774 2997.8411 3048.2832 3052.7166 3059.5805 3060.8397 3084.9239 3087.2905 3089.1828 3092.4043 3111.5215 3116.3371 3131.8222 3134.3694
redmass: 5.7546 4.7930 5.1117 4.1671 3.3756 2.1805 5.4934 2.3389 3.2754 3.5954 5.7728 5.8336 4.4302 3.0973 9.0372 10.9605 8.3252 2.5228 1.1096 2.4497 1.2735 3.1085 2.4418 3.8619 3.9267 4.1763 5.8438 11.7765 5.5018 9.2103 10.5183 8.8617 8.9829 9.6409 9.9702 10.9433 5.6124 7.5785 6.7704 8.0116 9.6108 1.1135 1.0923 1.1260 3.2011 2.5258 3.9308 12.2641 4.4184 1.8005 2.2816 2.5286 1.2105 2.3014 2.3356 2.5696 2.2818 1.4231 1.4071 1.5667 1.2290 1.1532 1.1512 1.1418 1.3199 7.5346 1.2528 1.2535 1.2413 1.2267 1.2035 1.1253 1.1109 6.4683 1.0402 1.0480 1.0385 1.0761 1.0564 1.0485 1.0594 1.0741 1.0358 1.0419 1.0436 1.0515 1.0490 1.0585 1.0596 1.1082 1.1076 1.0970 1.0970 1.1015 1.0980 1.1023 1.1027 1.1075 1.1087
irintensity: 0.4189 0.4646 0.2291 0.1989 1.5600 2.7045 0.3892 1.9306 0.3047 1.6163 4.6812 1.0953 3.4363 1.0274 6.8514 1.7203 3.3843 10.1504 0.0662 3.0339 0.6923 5.8253 5.4544 0.9574 0.6253 3.8876 5.2203 0.9179 17.4681 88.4287 5.6118 4.7841 51.0376 133.8427 17.8219 2.3907 8.5452 7.2706 64.7435 92.8773 1.9301 9.3077 5.9114 10.2173 134.0890 34.7760 188.7098 78.6348 16.8813 30.7370 84.7789 140.7565 0.4262 11.1837 20.0423 7.1719 12.3501 6.4055 9.8497 8.3811 0.4766 15.4739 0.6642 3.3257 57.1821 170.6819 6.0002 10.7700 25.6001 27.2884 23.0871 19.2508 17.1575 5.7594 12.9441 8.2744 16.3535 9.4911 5.8097 8.7606 20.6739 4.1023 28.8155 15.8928 15.0761 31.8613 37.3644 5.1602 2.9431 6.8211 26.5653 19.1182 23.3024 14.4119 26.4045 32.8111 15.1007 1.5483 17.2294
temp: 298.150 k
press: 1.00000 atm
elementType: 16 16 16 16 15 8 8 7 7 6 6 6 6 6 6 6 6 6 1 1 1 1 1 1 1 1 1 1 1 1 1 1 1 1 1
symmnumber: 1
zpe: 677590.4 jmol-1
zpe.correction: 0.258081 hartree
zpe.thermalcorrener: 0.281603 hartree
zpe.thermalcorrenthalpy: 0.282547 hartree
zpe.thermalcorrgfe: 0.200667 hartree
zpe.sumelectzpe: -2545.115069 hartree
zpe.sumelectthermal: -2545.091547 hartree
zpe.sumelectthermalent: -2545.090602 hartree
zpe.sumelectthermalfe: -2545.172483 hartree
dipole: 2.4085 2.1881 2.3526
dipole: 4.0154
quadrupole: -118.4564 -140.0232 -152.7594
quadrupole: -1.1174 -11.5271 3.7709
quadrupole: 18.6233 -2.9436 -15.6798 -1.1174 -11.5271 3.7709
hfenergy: -2545.3731498 hartree
pointgroup: C01 [X(C9H17N2O2P1S4)]
dipole: 0.907734 0.9436176 0.8839356 debye
polarizability: 347.9708899|23.3715196|195.0356443|29.9697461|-3.8088912|171.9067985 unknown
InChI: InChI=1S/C5H7N2S3.C4H10O2PS/c1-2-9-5-7-6-4(3-8)10-5;1-3-5-7(8)6-4-2/h2-3H2,1H3;3-4H2,1-2H3
charge 0 multiplicity 1
35 atoms
S  -1.487689 -1.361479 0.833592
S  2.25026 -2.189201 0.780744
S  -4.22624 -1.575855 -1.771563
S  5.016041 -0.735117 1.09309
P  -3.126008 -0.410225 -0.483473
O  -2.309449 0.854069 -1.340527
O  -3.93518 0.362241 0.851835
N  1.560009 -0.202439 -0.870116
N  2.871094 0.103489 -0.462915
C  -0.294806 -1.847208 -0.603717
C  -1.596813 1.936909 -0.581343
C  -5.427568 0.476315 0.832938
C  1.075066 -1.324479 -0.343462
C  -0.639361 2.589255 -1.57245
C  -5.819875 1.011772 2.206228
C  3.377628 -0.803554 0.379563
C  5.643946 0.877675 0.275908
C  7.077433 1.128573 0.755154
H  -0.687934 -1.392941 -1.527522
H  -0.328725 -2.943088 -0.679793
H  -2.363245 2.636775 -0.201846
H  -1.059079 1.485359 0.274487
H  -5.724675 1.163138 0.018367
H  -5.860843 -0.521368 0.632926
H  -1.183312 2.954043 -2.460416
H  0.136836 1.871706 -1.884339
H  -0.143017 3.452052 -1.088952
H  -5.357273 1.995786 2.392441
H  -5.500375 0.317544 3.001393
H  -6.918534 1.126052 2.258994
H  4.945262 1.674967 0.571781
H  5.573274 0.728536 -0.812306
H  7.12739 1.253757 1.851115
H  7.756206 0.307374 0.465077
H  7.455553 2.058264 0.291907
