program: Gaussian 09
title: 000217079
version: EM64L-G09RevD.01
frameworkgroup: C1[X(C8H15N2O2PS4)]
method: RPBEPBE
basis: SDD
operation: Freq
keyword: #p
keyword: freq=noraman
keyword: PBEPBE/SDD
title: #p freq=noraman PBEPBE/SDD
converged: YES YES NO NO
title: Mulliken charges:
elementType: S S S S P O O N N C C C C C C C C H H H H H H H H H H H H H H H
charge: 0.075137 0.320515 -0.215624 0.283745 0.567230 -0.478637 -0.476286 -0.057444 -0.020406 -0.771328 -0.216491 -0.206047 0.032029 -0.650350 -0.653226 -0.453887 -0.812296 0.322625 0.307066 0.221447 0.236988 0.232460 0.227135 0.215091 0.230395 0.231232 0.213464 0.231787 0.236702 0.289444 0.245903 0.291627
chargesum: 0.00000
title: Mulliken charges with hydrogens summed into heavy atoms:
elementType: S S S S P O O N N C C C C C C C C
charge: 0.075137 0.320515 -0.215624 0.283745 0.567230 -0.478637 -0.476286 -0.057444 -0.020406 -0.141636 0.241944 0.253548 0.032029 0.026368 0.028726 -0.453887 0.014679
polarizability: 3.21304564e+02 -7.37322648e+00 1.95032265e+02 1.41989803e+01 -4.26655097e+00 1.48936410e+02
1716.lowfreq: -12.6843 -4.9057 -1.2187 -0.0017 -0.0009 0.0007 11.5136 24.9958 27.4848
frequency: 10.9997 24.8026 27.0907 28.0145 29.5605 44.7542 54.9358 68.5176 73.1903 85.7721 104.9134 120.5255 124.4768 131.1568 168.0938 185.9077 207.2453 217.0682 241.2261 258.1223 266.2759 285.2359 291.4479 317.8580 331.4066 347.4606 405.0164 426.8599 454.3894 505.3465 547.6370 553.4741 580.9042 590.4826 644.8665 651.4122 658.9083 692.7584 733.0750 809.0318 809.8694 855.1494 866.9561 872.9140 958.1868 981.9100 983.7341 1008.7472 1013.7020 1023.1378 1103.1285 1104.6655 1113.8392 1130.3973 1134.3168 1203.0254 1245.2894 1254.2157 1256.4950 1318.0724 1350.8644 1353.2658 1354.3687 1393.6367 1395.1572 1416.4418 1432.9299 1448.0926 1452.0088 1456.9552 1458.2693 1475.5185 1476.9582 1485.9762 1488.2439 2985.0244 2991.9039 2996.2394 2996.4402 3029.5105 3047.1520 3049.1223 3060.3728 3091.4786 3092.9443 3108.7824 3112.3001 3127.4631 3158.5220 3164.0761
redmass: 4.9926 3.2921 2.6516 3.9709 5.1893 2.3023 3.8721 5.0956 4.4529 7.0897 6.5280 5.1193 1.8172 2.1366 4.8819 5.2184 3.1427 2.1873 1.3544 1.9433 4.3862 3.4675 8.1412 5.4764 3.8994 10.8734 5.8148 9.9962 8.7547 8.4344 10.5162 8.7027 11.3008 13.5768 7.5737 7.2527 6.7137 7.6834 9.8967 1.0907 1.0980 4.4501 2.0229 3.6926 6.1513 1.1935 3.7014 1.5450 2.3814 2.6748 2.2226 2.2442 2.4059 1.4099 1.4436 1.6526 1.1854 1.1501 1.1334 3.9809 1.2513 1.3605 1.2638 1.2366 1.2403 1.2541 1.0522 4.0967 1.0700 1.0399 1.0407 1.0539 1.0526 1.0791 1.0790 1.0555 1.0505 1.0404 1.0390 1.0276 1.0604 1.1055 1.1078 1.0979 1.0983 1.1021 1.1024 1.1068 1.1051 1.1062
irintensity: 0.3044 0.1560 0.2469 0.3313 0.2264 2.1274 0.9422 7.5016 1.8717 0.2125 1.9643 1.0366 1.2651 0.5151 2.1392 5.4398 3.8149 4.1154 1.3577 2.9663 5.3316 7.7577 0.6039 12.2478 1.0318 0.8517 8.6609 4.3662 53.9301 7.7650 134.9026 25.4545 7.4077 2.1368 4.3648 21.1015 102.1239 106.6225 0.7591 2.7786 2.4842 169.7568 6.9570 114.5301 59.1754 7.3611 24.5429 33.4918 119.8382 99.2300 10.1111 13.7116 10.5618 5.1216 4.8342 3.8210 15.1647 0.5913 0.0844 123.3089 5.3582 23.3592 6.2605 21.4196 28.2944 17.1514 15.0410 4.3295 31.5000 13.4707 13.7873 7.1609 10.9273 10.9573 10.8552 30.1079 23.0681 24.0740 23.4911 18.7564 1.1234 11.4169 9.8429 31.7685 27.1059 31.4609 29.1063 4.9624 5.3015 6.9710
temp: 298.150 k
press: 1.00000 atm
elementType: 16 16 16 16 15 8 8 7 7 6 6 6 6 6 6 6 6 1 1 1 1 1 1 1 1 1 1 1 1 1 1 1
symmnumber: 1
zpe: 604042.3 jmol-1
zpe.correction: 0.230068 hartree
zpe.thermalcorrener: 0.253136 hartree
zpe.thermalcorrenthalpy: 0.254080 hartree
zpe.thermalcorrgfe: 0.171462 hartree
zpe.sumelectzpe: -2505.891854 hartree
zpe.sumelectthermal: -2505.868785 hartree
zpe.sumelectthermalent: -2505.867841 hartree
zpe.sumelectthermalfe: -2505.950459 hartree
dipole: -0.3839 1.1380 3.8093
dipole: 3.9942
quadrupole: -119.1672 -137.2465 -144.1632
quadrupole: 9.8404 -12.1624 1.4250
quadrupole: 14.3584 -3.7208 -10.6376 9.8404 -12.1624 1.4250
hfenergy: -2506.1219214 hartree
pointgroup: C01 [X(C8H15N2O2P1S4)]
dipole: 0.4792738 -0.1985792 1.4833199 debye
polarizability: 310.0936352|7.2997654|195.1248268|-44.5966187|-5.9597425|160.0547769 unknown
InChI: InChI=1S/C8H15N2O2PS4/c1-4-11-13(14,12-5-2)16-6-7-9-10-8(15-3)17-7/h4-6H2,1-3H3
charge 0 multiplicity 1
32 atoms
S  0.488567 1.229564 -1.87519
S  -1.7410 -0.823782 0.393385
S  3.538142 -0.691664 -2.711226
S  -4.711029 -1.706872 0.892393
P  2.282569 -0.012128 -1.225813
O  3.022538 0.93409 0.047776
O  1.471217 -1.136778 -0.184673
N  -2.683329 1.670294 0.155339
N  -3.818161 0.878939 0.413183
C  -0.224722 1.632699 -0.130206
C  4.04912 1.949525 -0.326809
C  2.317385 -2.145923 0.536708
C  -1.541267 0.984106 0.114795
C  4.620212 2.483827 0.983455
C  1.350934 -3.125118 1.193757
C  -3.513961 -0.415105 0.561474
C  -6.280926 -0.657321 0.927299
H  0.550412 1.337698 0.594375
H  -0.354149 2.725631 -0.113448
H  3.561127 2.748572 -0.917922
H  4.822686 1.462846 -0.950854
H  2.936942 -1.608128 1.27745
H  2.974095 -2.646705 -0.200372
H  5.387593 3.250325 0.768871
H  3.829723 2.9456 1.599061
H  5.090168 1.672854 1.565166
H  1.92288 -3.885519 1.757443
H  0.67885 -2.603501 1.895917
H  0.736865 -3.638489 0.435161
H  -6.202339 0.090299 1.728111
H  -7.097559 -1.368938 1.121681
H  -6.406885 -0.159096 -0.043387
