program: Gaussian 09
title: 000217083
version: EM64L-G09RevD.01
frameworkgroup: C1[X(C7H13N2O3PS3)]
method: RPBEPBE
basis: SDD
operation: Freq
keyword: #p
keyword: freq=noraman
keyword: PBEPBE/SDD
title: #p freq=noraman PBEPBE/SDD
converged: YES YES NO NO
title: Mulliken charges:
elementType: S S S P O O O N N C C C C C C C H H H H H H H H H H H H H
charge: -0.018141 0.311626 0.279398 1.108955 -0.505271 -0.476133 -0.596495 -0.050565 -0.020736 -0.812411 0.029516 -0.454505 -0.568175 -0.663028 -0.478125 -0.481500 0.314128 0.337591 0.286792 0.286444 0.231527 0.232386 0.232626 0.249108 0.235846 0.247877 0.250968 0.239775 0.250523
chargesum: 0.00000
title: Mulliken charges with hydrogens summed into heavy atoms:
elementType: S S S P O O O N N C C C C C C C
charge: -0.018141 0.311626 0.279398 1.108955 -0.505271 -0.476133 -0.596495 -0.050565 -0.020736 -0.160693 0.029516 -0.454505 0.005061 0.033511 0.254706 0.259766
polarizability: 2.80131302e+02 6.97957218e+00 1.62731897e+02 -9.34713557e+00 1.14704585e+01 1.27566174e+02
1716.lowfreq: -12.3959 -2.9760 0.0019 0.0021 0.0030 3.2447 8.8390 22.2989 23.1461
frequency: 2.9738 22.1834 22.9989 40.6382 50.0780 65.7751 77.5899 79.2367 81.7338 88.6068 127.3699 142.2829 150.3018 165.3450 180.5516 213.8315 231.9758 237.3870 251.6061 275.0520 292.5779 331.3443 340.8722 361.6276 384.5278 435.9695 446.0900 505.2755 553.7522 580.5660 583.3587 611.9129 617.8098 650.3833 680.8410 729.8991 777.8288 876.2957 953.5085 962.4339 967.7147 990.8828 993.3840 1039.1750 1044.5632 1072.4519 1112.2492 1115.0337 1117.7293 1126.6001 1129.4065 1213.4410 1233.7527 1267.8568 1277.6833 1326.2129 1399.7906 1421.0041 1422.6417 1424.6159 1449.0489 1449.8163 1455.5540 1460.0429 1469.7913 1471.3078 1471.7556 1481.9706 2985.1174 2988.1123 2989.7326 3025.5127 3052.4927 3084.7554 3088.1635 3089.8741 3095.6228 3123.6569 3133.8078 3133.8998 3137.5082
redmass: 5.3679 5.0334 5.2236 3.7644 4.6394 2.5801 2.6740 2.1042 2.0088 4.2548 4.3006 5.7071 1.2542 5.9064 4.1370 6.3338 1.1072 6.9509 6.4934 4.1387 8.5412 4.3205 6.4864 5.9553 7.3399 10.4584 10.4046 8.3815 8.7733 10.9916 10.2049 5.6841 9.9813 7.6739 10.8807 9.8851 1.1134 2.1069 12.2961 11.7688 11.0231 2.8267 2.2971 15.8005 1.2102 2.2999 1.2508 1.2793 2.9075 1.2924 1.2889 1.3957 1.2297 1.2271 1.3024 6.7022 1.2048 1.1326 1.1266 1.1225 1.3895 2.8552 1.0502 1.0499 1.0528 1.0387 1.0533 1.0484 1.0305 1.0304 1.0357 1.0620 1.0596 1.0970 1.1015 1.1046 1.1040 1.1037 1.1087 1.1034 1.1039
irintensity: 1.0731 1.9744 0.7813 1.6897 1.8225 4.5286 3.8586 0.4126 3.4282 5.6231 5.9359 2.3884 0.2552 1.2029 4.2826 1.2064 0.0526 8.2219 8.9433 1.7901 2.0616 15.9378 5.2467 3.1921 44.6496 109.9781 4.1572 6.2605 32.7961 38.8490 1.1022 33.5803 156.3506 7.4030 102.4447 0.7684 9.1693 13.0674 92.4984 224.7994 89.7836 3.9850 42.4601 106.9902 0.2860 11.6412 0.1911 1.6739 10.8286 0.4863 0.2138 5.5059 0.5406 49.5874 32.9282 120.3216 22.2877 22.1765 1.6962 10.9600 18.3384 2.9022 13.3955 11.0127 19.9865 16.5282 14.3418 8.9791 49.8777 29.1765 28.3823 6.2514 3.1100 20.5413 14.7413 22.9890 25.0133 8.2185 16.6492 11.8551 7.2437
temp: 298.150 k
press: 1.00000 atm
elementType: 16 16 16 15 8 8 8 7 7 6 6 6 6 6 6 6 1 1 1 1 1 1 1 1 1 1 1 1 1
symmnumber: 1
zpe: 535437.3 jmol-1
zpe.correction: 0.203937 hartree
zpe.thermalcorrener: 0.225252 hartree
zpe.thermalcorrenthalpy: 0.226196 hartree
zpe.thermalcorrgfe: 0.147396 hartree
zpe.sumelectzpe: -2143.805362 hartree
zpe.sumelectthermal: -2143.784047 hartree
zpe.sumelectthermalent: -2143.783103 hartree
zpe.sumelectthermalfe: -2143.861903 hartree
dipole: -0.2677 0.6254 -2.4575
dipole: 2.5500
quadrupole: -90.2933 -125.8262 -131.5392
quadrupole: 9.7548 5.8898 -9.6538
quadrupole: 25.5930 -9.9400 -15.6530 9.7548 5.8898 -9.6538
hfenergy: -2144.0092991 hartree
pointgroup: C01 [X(C7H13N2O3P1S3)]
dipole: -0.1091478 0.3226419 -0.9436415 debye
polarizability: 280.1295559|6.7245857|160.5756564|-9.7077139|14.1291909|129.7241607 unknown
InChI: InChI=1S/C5H7N2S3.C2H6O3P/c1-2-9-5-7-6-4(3-8)10-5;1-4-6(3)5-2/h2-3H2,1H3;1-2H3
charge 0 multiplicity 1
29 atoms
S  -2.202307 -0.884912 -1.043141
S  0.881076 0.25989 0.999289
S  3.910487 0.984438 0.598477
P  -3.120823 0.534691 0.547453
O  -4.735986 0.752535 -0.035857
O  -2.520189 2.12105 0.302379
O  -2.909109 0.002286 2.029458
N  1.351686 -1.887652 -0.528322
N  2.588494 -1.22445 -0.445872
C  -1.027879 -1.79694 0.182678
C  0.368298 -1.284988 0.138065
C  2.527391 -0.107978 0.28996
C  5.266314 0.050746 -0.376857
C  6.572522 0.842574 -0.256398
C  -5.704886 -0.35554 0.135658
C  -2.511976 2.703262 -1.061489
H  -1.047344 -2.845173 -0.151692
H  -1.492467 -1.698477 1.179143
H  5.331885 -0.957618 0.059447
H  4.907919 -0.034334 -1.414008
H  6.477271 1.857112 -0.681967
H  6.901531 0.933048 0.793792
H  7.367483 0.315297 -0.814887
H  -5.86848 -0.564343 1.206868
H  -5.354744 -1.26593 -0.385119
H  -6.63102 0.013276 -0.328657
H  -3.541503 2.802195 -1.444722
H  -1.899056 2.083399 -1.741553
H  -2.050391 3.692435 -0.930027
