program: Gaussian 09
title: 000217107
version: EM64L-G09RevD.01
frameworkgroup: C1[X(C21H23N3O2)]
method: RPBEPBE
basis: SDD
operation: Freq
keyword: #p
keyword: freq=noraman
keyword: PBEPBE/SDD
title: #p freq=noraman PBEPBE/SDD
converged: YES YES NO NO
title: Mulliken charges:
elementType: O O N N N C C C C C C C C C C C C C C C C C C C C C H H H H H H H H H H H H H H H H H H H H H H H
charge: -0.299760 -0.235988 -0.303303 -0.143905 -0.296049 -0.303342 -0.271363 -0.554391 0.230837 0.137509 0.490100 -0.338976 -0.348300 0.422453 -0.404145 -0.410335 -0.433057 -0.387827 -0.364922 -0.316398 -0.231471 -0.234082 -0.245619 -0.227853 -0.246779 -0.250732 0.270391 0.302873 0.264930 0.245334 0.219171 0.232999 0.227860 0.259269 0.220973 0.194758 0.201548 0.222043 0.275419 0.267014 0.254519 0.294845 0.256242 0.226218 0.226285 0.228406 0.224974 0.224761 0.226867
chargesum: 0.00000
title: Mulliken charges with hydrogens summed into heavy atoms:
elementType: O O N N N C C C C C C C C C C C C C C C C C C C C C
charge: -0.299760 -0.235988 -0.303303 -0.143905 -0.020629 -0.032951 0.031511 -0.044127 0.230837 0.137509 0.490100 0.113194 0.138829 0.422453 0.011586 0.013256 -0.166043 -0.133308 -0.070078 -0.060156 -0.005253 -0.007797 -0.017213 -0.002879 -0.022019 -0.023865
polarizability: 3.03138157e+02 -9.09885555e-01 2.39360773e+02 5.49345461e+00 2.16951559e+01 1.95693332e+02
1716.lowfreq: -0.0007 -0.0002 0.0003 3.4631 7.0658 9.0650 18.9826 26.4325 46.3295
frequency: 18.9426 26.0243 46.2574 47.9929 53.7058 62.0143 67.4634 78.1563 105.7391 118.7663 144.6095 179.3968 201.5390 212.7830 249.4235 266.8605 277.9594 289.1327 327.1268 345.9516 365.9640 388.3685 404.5753 407.4658 418.5107 434.0585 456.3952 491.1969 511.5745 517.6150 551.8460 570.3386 580.6803 613.9466 614.4600 623.3987 635.3301 667.4065 672.3925 693.1006 700.8602 709.0483 741.4969 765.7085 775.0057 814.7627 828.1274 837.1618 840.4926 860.8273 865.5265 895.7116 909.6509 921.8533 931.6969 935.7563 970.1482 972.0297 983.4425 986.3664 990.0797 991.3292 998.6425 1019.9950 1026.9129 1032.0845 1047.0936 1050.7217 1058.1807 1071.6094 1087.2306 1088.7761 1104.3545 1116.3750 1150.2485 1155.0589 1165.5751 1172.8903 1174.0280 1189.1057 1191.1135 1195.6837 1199.7796 1215.3854 1224.8104 1243.7945 1253.1032 1258.6149 1279.1397 1291.0491 1306.2576 1320.6983 1321.9628 1329.6354 1340.1458 1342.1447 1354.2213 1358.8311 1382.0855 1382.9516 1390.0435 1426.4212 1445.0565 1445.7354 1446.0205 1449.6672 1458.3431 1462.3480 1467.4565 1472.1678 1483.6864 1489.3183 1569.8230 1587.9599 1594.6230 1611.2282 1614.3716 1633.1761 2870.3707 2883.4735 2986.4057 2993.6868 2994.1475 3005.9490 3024.8206 3044.9156 3050.3933 3086.5869 3101.3914 3105.9147 3121.3105 3126.0716 3127.1947 3137.4089 3138.3838 3146.8693 3158.2812 3162.9614 3173.8649 3196.8821 3473.2029
redmass: 5.2825 5.1839 4.4515 3.8088 3.7681 4.2010 4.4194 6.9351 7.2779 3.0938 4.9559 4.0751 3.7056 4.7024 3.3140 4.3385 3.3866 3.5871 5.0545 3.8708 5.3352 3.7539 2.8462 2.8959 2.3029 3.6627 3.0868 2.6698 2.2026 4.5442 3.3490 3.7630 3.6329 6.2959 6.3728 4.3077 4.7304 1.7002 5.3502 2.0278 4.5012 1.8878 3.2673 1.7953 2.3312 3.9562 3.1199 1.3083 1.5379 1.2476 3.2398 2.7384 1.4449 2.4964 1.6811 3.0403 1.4208 2.3943 1.5946 4.3473 1.3759 4.0571 1.3161 2.6761 2.2524 2.2503 2.1852 1.7147 2.0733 2.1796 3.2042 1.7900 2.3132 2.4644 2.9930 1.4745 2.5631 1.0532 1.0503 1.2742 1.9280 1.1043 1.1578 1.5463 2.0077 1.8002 1.7020 1.5771 1.2722 1.2605 1.4396 1.9001 1.4187 1.2671 1.4450 1.6701 1.3679 1.5774 8.0341 1.4932 3.6810 2.7889 1.3484 2.3056 1.6494 1.3038 1.0863 1.0759 1.1173 1.1048 2.2756 2.3033 7.4114 6.2444 6.0691 6.0452 5.9516 11.0466 1.0710 1.0700 1.0682 1.0813 1.0680 1.0653 1.0832 1.0898 1.0912 1.0987 1.0970 1.0936 1.0847 1.0876 1.0850 1.0920 1.0905 1.0963 1.0961 1.1015 1.0962 1.0947 1.0757
irintensity: 0.7477 0.4779 1.0322 0.1070 0.8207 0.5736 1.1170 1.0947 2.5247 5.7729 0.3599 1.0525 0.7737 1.8915 7.2086 0.4073 3.6858 6.2880 1.0490 5.1157 6.4030 16.2421 0.2893 0.1091 1.0535 3.0305 8.4701 27.8151 61.1429 31.1745 23.9115 0.4521 18.8566 1.0045 0.2333 6.6338 0.1480 69.4564 15.5361 33.7851 18.7160 48.4233 40.7228 46.7765 32.3861 7.0370 2.8168 0.6614 0.1044 0.4742 2.7439 5.8939 8.1074 2.0627 4.3837 0.3138 1.0377 2.9639 0.4900 0.1896 0.7380 0.2483 0.4078 26.3233 11.6692 5.7471 46.7605 2.8516 2.8768 15.4471 13.2492 7.1896 27.2044 23.6257 23.7707 26.2952 10.0618 0.1764 0.3937 20.5580 44.3191 4.0155 2.7325 53.0990 140.8489 29.7924 69.9716 37.0875 21.8958 25.1304 8.8966 88.3326 80.3428 2.8336 35.1711 56.4533 8.2289 9.7779 0.2239 1.7116 8.3751 105.1351 14.4612 0.8747 18.8393 5.2747 18.9487 0.2107 17.9363 1.9959 14.8438 108.4572 269.1524 2.2643 0.3860 52.5351 22.2859 301.8623 70.3630 91.0639 26.6806 12.1358 40.8620 10.8478 15.3601 45.9211 53.7856 14.1782 6.6878 24.0910 1.7563 0.8911 0.4498 12.4345 17.0928 28.7981 42.5701 25.4538 6.8979 3.9926 0.0637
temp: 298.150 k
press: 1.00000 atm
elementType: 8 8 7 7 7 6 6 6 6 6 6 6 6 6 6 6 6 6 6 6 6 6 6 6 6 6 1 1 1 1 1 1 1 1 1 1 1 1 1 1 1 1 1 1 1 1 1 1 1
symmnumber: 1
zpe: 1056444.8 jmol-1
zpe.correction: 0.402379 hartree
zpe.thermalcorrener: 0.424691 hartree
zpe.thermalcorrenthalpy: 0.425635 hartree
zpe.thermalcorrgfe: 0.348842 hartree
zpe.sumelectzpe: -1126.875783 hartree
zpe.sumelectthermal: -1126.853471 hartree
zpe.sumelectthermalent: -1126.852527 hartree
zpe.sumelectthermalfe: -1126.929320 hartree
dipole: 4.7748 3.5305 -2.0610
dipole: 6.2857
quadrupole: -133.8190 -157.5328 -152.3637
quadrupole: -4.7452 -5.8767 -0.4802
quadrupole: 14.0862 -9.6276 -4.4586 -4.7452 -5.8767 -0.4802
hfenergy: -1127.2781618 hartree
pointgroup: C01 [X(C21H23N3O2)]
dipole: -1.7080523 1.7875437 0.0547092 debye
polarizability: 302.5916572|-4.6271632|214.4254617|4.8522358|-31.1225822|221.1751428 unknown
InChI: InChI=1S/C21H23N3O2/c25-19-15-18(21(26)23-13-11-22-12-14-23)20(16-7-3-1-4-8-16)24(19)17-9-5-2-6-10-17/h1-10,18,20,22H,11-15H2
charge 0 multiplicity 1
49 atoms
O  -1.896356 -1.054108 -1.900623
O  1.31913 -2.701487 2.291932
N  1.35892 -1.096312 0.523976
N  -3.437415 -0.599672 -0.221983
N  -5.849271 0.824662 0.276713
C  -0.996654 -0.664133 0.346046
C  0.372979 -0.40985 -0.366175
C  -0.765379 -1.949591 1.176979
C  -2.140312 -0.780439 -0.677817
C  0.744726 -1.97525 1.435976
C  0.618408 1.085348 -0.558862
C  -3.857682 -0.307971 1.166445
C  -4.570243 -0.697681 -1.176243
C  2.769997 -1.03489 0.269647
C  -4.708997 0.981642 1.202808
C  -5.415188 0.591257 -1.119125
C  0.196504 1.698099 -1.765178
C  1.184989 1.886711 0.462851
C  3.710134 -1.43029 1.26078
C  3.242288 -0.577312 -0.990537
C  0.338675 3.092182 -1.946816
C  1.332288 3.279025 0.279075
C  0.90836 3.887501 -0.925706
C  5.091854 -1.366623 0.982576
C  4.626205 -0.517493 -1.252635
C  5.562452 -0.91037 -0.269766
H  -1.173687 0.184633 1.030437
H  0.338265 -0.907998 -1.355196
H  -1.025243 -2.859681 0.602916
H  -1.31946 -1.985444 2.128888
H  -2.983701 -0.20481 1.825855
H  -4.476961 -1.149362 1.536397
H  -5.203647 -1.561692 -0.895497
H  -4.148719 -0.86346 -2.179985
H  -5.091275 1.135862 2.228215
H  -4.048367 1.845857 0.941693
H  -4.803936 1.431731 -1.530349
H  -6.307164 0.468234 -1.75928
H  -6.546209 1.573397 0.364473
H  -0.251666 1.078889 -2.551812
H  1.531428 1.416155 1.390269
H  3.355239 -1.802068 2.223004
H  2.540094 -0.264199 -1.767192
H  0.010864 3.555461 -2.884348
H  1.784775 3.88788 1.070004
H  1.026939 4.967461 -1.068948
H  5.80352 -1.676928 1.756012
H  4.970307 -0.161151 -2.230006
H  6.637091 -0.861417 -0.475987
