program: Gaussian 09
title: 000217075
version: EM64L-G09RevD.01
frameworkgroup: C1[X(C8H15N2O4PS3)]
method: RPBEPBE
basis: SDD
operation: Freq
keyword: #p
keyword: freq=noraman
keyword: PBEPBE/SDD
title: #p freq=noraman PBEPBE/SDD
converged: YES YES NO NO
title: Mulliken charges:
elementType: S S S P O O O O N N C C C C C C C C H H H H H H H H H H H H H H H
charge: 0.077193 0.305609 -0.215061 0.578867 -0.226122 -0.476099 -0.464876 -0.264842 -0.054765 -0.088452 -0.756070 0.013546 -0.258596 -0.311504 -0.086968 -0.469065 -0.479239 -0.497087 0.308845 0.323686 0.236382 0.259564 0.226371 0.198227 0.242578 0.247397 0.245249 0.246226 0.235676 0.245847 0.199486 0.227798 0.230200
chargesum: 0.00000
title: Mulliken charges with hydrogens summed into heavy atoms:
elementType: S S S P O O O O N N C C C C C C C C
charge: 0.077193 0.305609 -0.215061 0.578867 -0.226122 -0.476099 -0.464876 -0.264842 -0.054765 -0.088452 -0.123539 0.013546 0.237350 0.113094 -0.086968 0.266160 0.248510 0.160396
polarizability: 2.85963025e+02 -2.69428325e+01 1.92161976e+02 1.10964352e+01 -6.43157606e-01 1.41511658e+02
1716.lowfreq: -12.2278 -0.0014 -0.0011 -0.0004 3.7071 5.1796 16.6980 24.8789 28.7243
frequency: 16.4973 24.0990 28.5399 35.4077 50.1012 51.4517 70.7293 73.0367 87.6587 92.7010 98.1176 109.9533 120.8226 131.3157 132.6160 155.2504 177.5162 194.4737 209.8326 238.3367 265.5640 271.3078 300.9516 319.2368 357.2136 368.3751 377.1341 382.0048 422.5280 465.4919 513.4199 537.6263 549.5579 567.7070 589.3763 629.8144 649.5967 677.1099 698.4957 749.0401 783.9761 835.4375 874.4104 944.3325 951.8494 967.9932 996.2558 1017.7120 1060.0604 1101.3491 1108.7901 1111.4011 1116.1123 1116.5681 1126.7791 1128.3344 1154.8168 1157.0956 1209.9008 1225.0284 1248.4899 1282.2209 1336.6132 1368.5996 1414.0215 1419.8887 1423.8417 1425.1356 1430.8754 1442.0666 1450.4027 1453.9690 1454.4505 1456.0944 1458.9199 1469.0341 1471.6597 1476.6892 2948.3008 2955.0511 2978.8118 2988.9798 3013.9856 3039.6733 3049.6395 3060.2895 3079.7085 3091.6198 3095.7028 3109.1231 3127.7985 3129.7326 3133.3513
redmass: 5.5322 5.0087 5.7412 6.5515 3.7305 4.9246 3.8671 3.1338 3.4859 2.9340 1.2687 1.1836 4.7851 5.0276 4.7306 4.7801 2.8913 1.8553 4.4453 6.2402 8.8732 3.5362 4.2830 4.2949 2.3932 5.8158 5.1538 8.4947 8.1660 2.5064 7.5435 15.6450 7.4137 8.8100 12.3602 10.8883 7.4539 13.1162 7.6932 6.0566 3.7780 5.5299 1.9195 2.5138 11.5750 11.2977 2.3937 4.9303 2.4343 4.6433 1.2423 4.0348 1.2545 1.2721 1.3000 1.2981 1.6822 1.5619 1.1582 2.2128 1.2592 1.1343 1.5303 1.2934 1.2795 1.1356 1.3311 1.6004 1.1031 1.1236 2.0998 1.0504 1.0526 1.4628 1.3950 1.0533 1.0529 1.0727 1.0367 1.0645 1.0301 1.0291 1.0589 1.0992 1.0580 1.0955 1.1053 1.1070 1.1056 1.1005 1.1024 1.1071 1.1038
irintensity: 0.3359 0.0595 0.0043 0.9718 1.8113 3.2616 0.6405 3.3858 4.2683 5.3601 1.3124 0.8920 3.9087 2.7018 4.9553 0.8499 5.5831 8.8238 2.2023 11.0065 6.6468 1.7103 3.6317 5.2694 5.3348 7.1996 2.6299 0.3608 34.7649 15.9151 16.5879 164.5895 0.5580 28.2387 4.3890 95.2256 33.4335 135.1586 3.4078 1.7497 7.3112 97.8513 4.2988 8.0702 183.5679 126.1105 12.8179 69.4702 26.9090 65.9223 0.2274 58.5284 0.6679 1.0391 0.5381 0.7901 24.1995 50.1001 7.3507 42.8320 32.5692 11.8092 152.3308 7.8006 14.2441 5.0720 140.7469 237.7755 26.3876 5.3798 8.6785 7.3119 21.5646 32.6761 78.7718 17.3869 16.3159 12.2365 50.3362 52.6576 52.7402 41.0924 14.0920 59.5275 1.4520 26.4040 21.3928 16.0244 19.4710 40.8444 10.0360 4.4008 10.1821
temp: 298.150 k
press: 1.00000 atm
elementType: 16 16 16 15 8 8 8 8 7 7 6 6 6 6 6 6 6 6 1 1 1 1 1 1 1 1 1 1 1 1 1 1 1
symmnumber: 1
zpe: 622434.7 jmol-1
zpe.correction: 0.237073 hartree
zpe.thermalcorrener: 0.260548 hartree
zpe.thermalcorrenthalpy: 0.261492 hartree
zpe.thermalcorrgfe: 0.179185 hartree
zpe.sumelectzpe: -2258.146963 hartree
zpe.sumelectthermal: -2258.123488 hartree
zpe.sumelectthermalent: -2258.122544 hartree
zpe.sumelectthermalfe: -2258.204851 hartree
dipole: -1.3814 0.6692 4.5057
dipole: 4.7600
quadrupole: -129.0177 -138.0380 -138.4844
quadrupole: 10.2129 -1.7202 2.3824
quadrupole: 6.1623 -2.8579 -3.3044 10.2129 -1.7202 2.3824
hfenergy: -2258.3840362 hartree
pointgroup: C01 [X(C8H15N2O4P1S3)]
dipole: 0.725963 0.6275535 -1.6081931 debye
polarizability: 279.4339635|24.2773386|190.6528103|32.1244232|13.8890231|149.549886 unknown
InChI: InChI=1S/C8H15N2O4PS3/c1-11-4-5-14-8-10-9-7(18-8)6-17-15(16,12-2)13-3/h4-6H2,1-3H3
charge 0 multiplicity 1
33 atoms
S  2.195768 -1.352639 1.720904
S  -0.663041 0.090992 -0.338096
S  4.422435 1.53823 2.399245
P  3.414755 0.420584 0.994319
O  -3.404761 -0.031198 -0.525418
O  2.204669 1.159872 -0.003464
O  4.37417 -0.215846 -0.326302
O  -6.248732 0.911435 0.472983
N  -0.916753 -2.566223 -0.06016
N  -2.233791 -2.096357 -0.20993
C  1.462529 -1.903472 0.022446
C  0.009882 -1.609263 -0.103675
C  -4.6973 -0.804231 -0.509255
C  -5.834367 0.191017 -0.725915
C  -2.27428 -0.768737 -0.363047
C  2.545963 2.431028 -0.689334
C  5.69009 -0.810788 -0.005985
C  -5.340045 1.992436 0.875339
H  1.611327 -2.993864 -0.011115
H  2.078073 -1.417063 -0.749909
H  -4.648264 -1.557028 -1.317682
H  -4.782028 -1.32189 0.46227
H  -6.731046 -0.379029 -1.029735
H  -5.564402 0.891797 -1.546257
H  2.874946 3.187648 0.045496
H  1.605821 2.745317 -1.165843
H  3.328637 2.260297 -1.448266
H  6.169828 -0.974171 -0.982372
H  5.561461 -1.7733 0.521923
H  6.293363 -0.118759 0.609544
H  -5.150567 2.689467 0.032304
H  -4.370102 1.604018 1.239168
H  -5.857542 2.526521 1.687618
