program: Gaussian 09
title: 000217077
version: EM64L-G09RevD.01
frameworkgroup: C1[X(C10H19N2O5PS2)]
method: RPBEPBE
basis: SDD
operation: Freq
keyword: #p
keyword: freq=noraman
keyword: PBEPBE/SDD
title: #p freq=noraman PBEPBE/SDD
converged: YES YES NO NO
title: Mulliken charges:
elementType: S S P O O O O O N N C C C C C C C C C C H H H H H H H H H H H H H H H H H H H
charge: 0.006199 0.275296 1.069278 -0.510196 -0.489902 -0.200263 -0.584939 -0.268107 -0.056801 -0.089766 -0.741173 -0.259577 -0.224169 -0.004959 -0.269840 -0.260432 -0.647669 -0.659946 -0.084791 -0.496544 0.302004 0.322011 0.229331 0.238777 0.252958 0.225314 0.262106 0.227371 0.209962 0.193369 0.231336 0.249233 0.216509 0.246504 0.231104 0.211670 0.239806 0.201423 0.207513
chargesum: 0.00000
title: Mulliken charges with hydrogens summed into heavy atoms:
elementType: S S P O O O O O N N C C C C C C C C C C
charge: 0.006199 0.275296 1.069278 -0.510196 -0.489902 -0.200263 -0.584939 -0.268107 -0.056801 -0.089766 -0.117158 0.208531 0.254102 -0.004959 0.219637 0.142899 0.049409 0.029332 -0.084791 0.152198
polarizability: 3.13368864e+02 -4.99507411e+00 1.88748042e+02 -6.07785003e+00 -1.53464238e+00 1.47465413e+02
1716.lowfreq: -15.9719 -0.0021 -0.0011 -0.0003 1.4820 3.6768 8.2715 14.8859 19.2750
frequency: -15.5794 14.8257 18.5664 23.2284 29.6195 45.4594 52.0214 58.6713 62.8124 70.3456 79.0591 96.9048 124.4181 132.6224 139.5756 149.7151 166.0932 188.3564 213.6348 224.6178 234.3753 250.9101 262.1202 265.4894 280.2997 288.0434 318.2184 345.1346 378.6290 384.7930 406.2885 411.5230 468.6378 475.3729 520.9265 552.7401 570.7245 585.4555 592.1372 649.6153 663.1533 703.5907 750.8749 795.7749 798.8724 800.5276 835.9500 850.9699 859.0864 865.9181 985.3582 1001.2714 1002.3961 1008.8907 1014.7814 1040.0518 1064.8310 1090.4214 1092.2333 1093.5746 1109.2202 1122.8151 1139.8267 1142.3661 1157.8813 1157.9428 1199.7593 1228.0505 1246.0895 1250.6353 1267.3443 1267.8492 1337.9763 1349.1847 1352.2499 1387.2232 1387.6887 1391.6213 1421.9873 1432.3141 1438.4702 1453.7085 1457.0067 1458.0400 1459.9633 1460.7504 1463.2874 1464.0601 1465.9189 1477.3769 1481.5398 1485.6190 2920.8726 2931.0459 2977.9502 2988.9317 2989.4955 3004.0803 3008.9107 3018.0334 3026.8539 3051.3183 3081.8742 3085.1228 3087.5244 3091.4539 3101.0627 3110.9842 3112.1329 3117.0753 3134.1348
redmass: 3.3332 4.9323 5.4816 4.5893 6.2807 2.6909 4.2965 3.7802 3.5881 3.3321 3.5846 6.1066 4.4498 3.7275 3.0012 5.9518 6.8401 2.8156 1.4110 4.3548 1.2862 1.5006 2.1790 5.8924 3.4025 2.5073 4.7371 4.5070 6.5181 7.8453 3.9335 4.2432 6.0293 3.3584 7.5710 6.8973 8.7364 11.0331 8.1426 7.6180 7.0966 7.1069 6.5776 2.8451 1.1180 1.1190 5.2991 3.6291 4.1740 1.9888 2.4847 2.5303 2.4082 2.7948 4.0774 14.9714 2.8593 5.1603 2.2032 2.2203 1.6935 1.8542 1.5255 1.5385 1.7295 1.7339 1.1169 2.2693 1.1473 1.1334 1.1203 1.1132 1.4745 1.2145 1.2188 1.2367 1.5009 1.2272 1.1658 1.7990 1.1654 2.8865 1.0467 1.1202 1.0560 1.0653 1.7658 1.0533 1.2577 1.0672 1.0541 1.0550 1.0527 1.0400 1.1008 1.0361 1.0363 1.1028 1.0646 1.0603 1.0590 1.0581 1.1011 1.0974 1.0997 1.1000 1.1074 1.0972 1.1051 1.1031 1.1079
irintensity: 1.4689 0.3689 0.2366 0.6561 0.4969 0.2846 0.6195 1.4454 3.7818 1.8146 7.4958 3.0536 3.8730 5.0913 3.4706 3.8966 1.8319 9.8752 2.6437 1.8737 1.1063 5.6630 6.4209 11.1898 7.2417 3.2367 5.9779 1.7927 2.8653 4.3667 28.7469 46.2225 88.1869 7.8154 22.3767 4.1056 90.5043 54.3303 67.4961 6.7515 88.9154 3.4179 0.9934 10.8211 2.3058 6.4028 68.6088 117.9579 170.9167 1.5191 11.0106 117.3386 94.9540 112.5396 56.0487 131.0181 86.2677 58.9864 11.5389 2.1064 15.5106 20.7377 5.0585 6.4046 28.0344 45.9745 12.9563 45.6715 13.1789 9.6215 0.2162 0.3603 219.2045 20.1924 4.1934 29.6857 23.4803 32.1185 16.5993 365.5786 3.9196 12.1711 10.5350 47.8470 13.6761 7.8755 129.7086 10.9830 15.2605 6.7408 10.0328 11.9060 50.6481 107.3728 48.2256 16.1128 19.9362 65.4855 15.2095 31.7325 23.6816 6.2051 20.6499 23.2631 19.2103 2.6750 13.2962 25.5623 26.8283 23.5177 1.4382
temp: 298.150 k
press: 1.00000 atm
elementType: 16 16 15 8 8 8 8 8 7 7 6 6 6 6 6 6 6 6 6 6 1 1 1 1 1 1 1 1 1 1 1 1 1 1 1 1 1 1 1
symmnumber: 1
zpe: 772818.3 jmol-1
zpe.correction: 0.294351 hartree
zpe.thermalcorrener: 0.319161 hartree
zpe.thermalcorrenthalpy: 0.320105 hartree
zpe.thermalcorrgfe: 0.234567 hartree
zpe.sumelectzpe: -2013.751016 hartree
zpe.sumelectthermal: -2013.726207 hartree
zpe.sumelectthermalent: -2013.725262 hartree
zpe.sumelectthermalfe: -2013.810800 hartree
dipole: -4.0005 1.0229 4.4875
dipole: 6.0982
quadrupole: -105.4822 -138.4644 -146.0932
quadrupole: -0.6749 3.6690 4.6103
quadrupole: 24.5310 -8.4511 -16.0800 -0.6749 3.6690 4.6103
hfenergy: -2014.0453673 hartree
pointgroup: C01 [X(C10H19N2O5P1S2)]
dipole: -1.4984517 1.3726988 1.2754057 debye
polarizability: 312.05299|-5.2231815|170.5776293|-15.6384467|-20.1253226|166.9516993 unknown
InChI: InChI=1S/C6H9N2O2S2.C4H10O3P/c1-9-2-3-10-6-8-7-5(4-11)12-6;1-3-6-8(5)7-4-2/h2-4H2,1H3;3-4H2,1-2H3
charge 0 multiplicity 1
39 atoms
S  2.211334 -0.636765 0.93658
S  -1.546684 -1.371572 1.26938
P  3.810045 -0.137405 -0.661012
O  4.592936 1.172649 0.16772
O  2.916262 0.584785 -1.942961
O  -3.864346 0.082457 1.02198
O  4.76018 -1.29504 -1.188861
O  -6.817385 -0.11434 0.574942
N  -0.87437 -0.025575 -0.949964
N  -2.163005 0.432223 -0.62918
C  0.957888 -1.545004 -0.221183
C  6.058302 1.046712 0.462755
C  2.041951 1.785359 -1.717726
C  -0.395245 -0.936159 -0.105156
C  -4.736463 1.057739 0.284181
C  -6.078065 1.074691 0.989134
C  6.309934 0.180709 1.698313
C  2.81202 3.069777 -2.019215
C  -2.649571 -0.152761 0.470392
C  -8.088602 -0.255175 1.283217
H  0.98042 -2.604821 0.069116
H  1.320614 -1.425803 -1.254688
H  6.359709 2.094611 0.625375
H  6.57671 0.644686 -0.426958
H  1.200936 1.619142 -2.409185
H  1.649632 1.764458 -0.682953
H  -4.833658 0.721999 -0.762283
H  -4.237417 2.042931 0.310422
H  -5.93074 1.094125 2.091195
H  -6.627092 1.998306 0.693689
H  5.731575 0.552872 2.561292
H  6.036687 -0.871823 1.508157
H  7.38405 0.212364 1.961571
H  3.63473 3.215701 -1.299364
H  3.22903 3.043293 -3.040527
H  2.124064 3.933904 -1.950127
H  -8.552692 -1.175637 0.897261
H  -8.763536 0.606364 1.089799
H  -7.934339 -0.351877 2.378775
