program: Gaussian 09
title: 000217069
version: EM64L-G09RevD.01
frameworkgroup: C1[X(C6H11N2O3PS3)]
method: RPBEPBE
basis: SDD
operation: Freq
keyword: #p
keyword: freq=noraman
keyword: PBEPBE/SDD
title: #p freq=noraman PBEPBE/SDD
converged: NO YES NO NO
title: Mulliken charges:
elementType: S S S P O O O N N C C C C C C H H H H H H H H H H H
charge: 0.057895 0.282763 -0.221725 0.589889 -0.463660 -0.474490 -0.208980 -0.042067 -0.084668 -0.674208 -0.051953 -0.093802 -0.481866 -0.471764 -0.501182 0.314923 0.322770 0.245555 0.237204 0.245485 0.241377 0.245560 0.244917 0.251581 0.238388 0.252057
chargesum: 0.00000
title: Mulliken charges with hydrogens summed into heavy atoms:
elementType: S S S P O O O N N C C C C C C
charge: 0.057895 0.282763 -0.221725 0.589889 -0.463660 -0.474490 -0.208980 -0.042067 -0.084668 -0.036514 -0.051953 -0.093802 0.246378 0.260091 0.240843
polarizability: 2.92438869e+02 -8.56338790e+00 1.38552818e+02 -1.13262621e+01 8.15601000e+00 1.27184055e+02
1716.lowfreq: -11.3588 -2.6465 -0.0029 -0.0017 -0.0017 3.4043 19.4929 27.0534 36.5684
frequency: 16.7972 26.6540 36.4779 45.1586 63.7536 70.5569 82.4701 109.5646 121.1680 125.7163 131.2579 134.8369 144.5562 170.7703 191.9230 199.2253 230.6490 267.7326 302.0403 316.8757 367.2568 374.4799 384.8498 422.5346 520.9165 534.0283 541.2248 561.8798 587.2357 633.2153 659.1811 675.8225 678.7141 753.8805 886.6489 910.0426 952.7850 969.3125 1009.9086 1097.5523 1108.0188 1113.4868 1115.1308 1126.4918 1127.3045 1147.9448 1155.4559 1219.7310 1244.0147 1380.9639 1419.6135 1424.8097 1433.3511 1448.6889 1453.6084 1454.4305 1455.6379 1461.2836 1469.6540 1470.9771 1471.8121 2979.4970 2987.4725 3010.5769 3063.4363 3080.7820 3093.6075 3118.5256 3126.8431 3133.4757 3149.8156 3161.4970
redmass: 5.9236 8.7880 6.4322 3.2025 7.0700 3.9293 5.0596 3.8996 1.1675 1.4041 1.5538 4.1958 1.8390 4.0732 3.3183 5.9611 6.6283 8.8624 3.7684 5.9170 7.0926 7.2385 7.8651 8.8356 8.4351 8.5852 15.5667 7.9316 12.5727 11.2730 8.3330 9.0935 9.6880 9.8160 1.7654 9.8301 11.5805 11.3696 3.9709 4.1395 1.2467 1.2437 1.2524 1.3063 1.2976 1.7054 1.5169 2.5094 1.3021 2.0915 1.1211 1.1199 1.2185 1.0509 1.0485 1.0529 4.0124 1.0499 1.0646 1.0530 2.2144 1.0300 1.0294 1.0286 1.0569 1.1052 1.1052 1.1056 1.1025 1.1037 1.1094 1.1060
irintensity: 0.8092 0.3814 1.1821 3.4659 1.5900 1.2819 7.2681 6.4746 0.1044 0.6031 0.9647 3.1675 1.7139 2.6417 12.9433 1.2156 16.4534 8.9158 12.8606 2.0641 7.5105 3.0175 8.2671 24.6462 28.7596 6.9564 207.7343 14.2779 2.3085 96.4133 5.8158 54.5553 76.7476 1.3929 4.9287 57.3637 200.1621 126.7377 51.0015 80.2165 0.6083 0.0131 0.1406 0.4914 0.4909 31.5682 11.1006 34.8804 12.2288 329.7215 1.4064 3.7311 23.9320 15.7532 11.3686 23.4911 11.4839 32.0646 20.5124 15.4913 310.4750 47.2639 47.4963 43.9887 6.5526 22.5491 20.7231 19.4848 10.0365 10.7212 1.6365 15.2074
temp: 298.150 k
press: 1.00000 atm
elementType: 16 16 16 15 8 8 8 7 7 6 6 6 6 6 6 1 1 1 1 1 1 1 1 1 1 1
symmnumber: 1
zpe: 466050.7 jmol-1
zpe.correction: 0.177509 hartree
zpe.thermalcorrener: 0.197213 hartree
zpe.thermalcorrenthalpy: 0.198157 hartree
zpe.thermalcorrgfe: 0.125259 hartree
zpe.sumelectzpe: -2104.577946 hartree
zpe.sumelectthermal: -2104.558242 hartree
zpe.sumelectthermalent: -2104.557298 hartree
zpe.sumelectthermalfe: -2104.630196 hartree
dipole: -1.0425 0.0287 2.5558
dipole: 2.7604
quadrupole: -93.0163 -117.4111 -120.9914
quadrupole: 4.5051 13.9578 -5.8788
quadrupole: 17.4567 -6.9382 -10.5185 4.5051 13.9578 -5.8788
hfenergy: -2104.755455 hartree
pointgroup: C01 [X(C6H11N2O3P1S3)]
dipole: -0.3532974 -0.1248518 1.0193517 debye
dipolederiv: -0.8536703 0.0068234 0.0392866 0.0403277 -0.1936214 -0.0011509 0.1621362 -0.0721022 -0.1819965 -0.3956258 0.0285633 -0.0507625 0.1132693 -0.3311177 -0.1937018 -0.0662824 -0.2124061 0.0493453 -0.7982826 0.0223764 0.2451771 0.062657 -0.3752563 0.0015458 0.1715842 -0.0292154 -0.5188209 2.2325895 0.0321959 -0.3648813 -0.3224985 1.455666 -0.0959241 0.3606548 0.1708698 1.4179671 -0.7777797 -0.2325332 0.0005018 -0.3327848 -1.0919717 -0.1656035 -0.2727185 -0.316136 -0.6476518 -0.8678113 0.2436073 -0.1213778 0.4034818 -0.9580207 0.3400073 -0.2929178 0.3958702 -0.7872289 -2.1681081 0.1232085 -0.0622383 -0.1794834 -0.3448096 -0.0303784 -0.3090274 -0.0190141 -0.2890207 0.354227 -0.1458682 -0.0624173 -0.1161811 -0.3816045 -0.1018849 0.117425 -0.1425671 -0.2031719 -0.9774011 0.1900291 0.1123982 -0.6841221 -0.3683782 -0.0949736 -0.5029129 -0.0673026 -0.1809755 0.2402435 0.0225971 -0.1231299 0.0437422 0.0361483 -0.0431793 -0.6013959 -0.0067046 0.2484437 0.2944214 0.1895968 0.0688063 0.4969323 0.5177434 0.2778515 0.4621607 0.3042842 -0.0393405 1.9370165 -0.1756788 0.0879276 0.7269251 0.4996577 0.1562274 0.5862635 0.1707207 0.177824 0.319699 0.1730352 0.0917508 0.2594006 0.6517024 0.1522459 -0.0835565 -0.160094 0.1340546 0.4668885 -0.3947023 0.3079408 -0.0987123 0.3777835 -0.1220589 0.1343553 -0.1285574 0.3685058 0.9285824 -0.1323137 -0.0182742 -0.4348145 0.3174707 -0.0094944 -0.1121827 -0.0008276 0.2715679 0.0187893 -0.0171731 0.0161218 -0.0457059 0.0512585 -0.0434673 0.0521478 -0.0404884 0.009137 0.0664368 -0.0015158 0.0152529 -0.0198273 0.0321131 0.0496173 0.0789137 0.0245078 0.0331695 0.096339 -0.0418983 -0.036014 -0.0697696 0.000751 -0.0726248 -0.0551071 -0.0767092 -0.0468701 -0.0162901 0.0887419 -0.0781272 0.0221583 -0.0607937 0.0201781 -0.0306699 0.11666 0.0569183 -0.0567553 -0.0397344 0.0537942 0.031211 0.0380306 -0.0383194 0.1466187 0.0604625 0.0671463 -0.0434983 0.1195763 0.0123396 0.0239985 0.08895 -0.0056291 0.1084999 -0.0613315 -0.0179098 0.0356401 -0.0323249 0.003414 -0.0195064 -0.0501151 0.0995679 -0.0186643 0.1145639 0.0569436 -0.0004626 0.0383407 -0.1048233 -0.0514155 0.007933 -0.1035626 -0.0927574 -0.0329447 -0.0264113 0.0365121 0.0147632 -0.0328531 0.1241469 0.0708958 -0.0176111 0.0728868 -0.0310414 -0.0917034 -0.1027514 -0.038838 -0.0411464 -0.0866223 0.0571353 -0.041459 -0.0685775 -0.0365596 0.1035205 0.0310518 -0.0408743 0.0413336 0.1131927 -0.0475501 0.0837819 0.0531239 0.0760626 0.0365575 unknown
polarizability: 289.7625026|-11.2525086|136.512572|-21.8741047|10.5703574|131.9006677 unknown
InChI: InChI=1S/C6H11N2O3PS3/c1-9-6-8-7-5(15-6)4-14-12(13,10-2)11-3/h4H2,1-3H3
charge 0 multiplicity 1
26 atoms
S  0.821043 0.191305 -1.381366
S  -2.468473 -1.235248 -0.530345
S  4.384343 -0.348425 -2.253771
P  2.957091 -0.276747 -0.767879
O  3.287169 0.808524 0.566251
O  2.646227 -1.686707 0.194083
O  -5.120604 -0.522715 -0.531195
N  -2.180424 1.179123 0.609843
N  -3.560669 1.048252 0.384809
C  0.009431 0.031407 0.368232
C  -1.466186 0.124238 0.220579
C  -3.870521 -0.119442 -0.188125
C  3.883079 2.126628 0.25899
C  3.812583 -2.361591 0.815636
C  -6.212504 0.450344 -0.242384
H  0.374005 0.864951 0.984657
H  0.350486 -0.933034 0.771159
H  4.123258 2.5601 1.241211
H  3.156906 2.767992 -0.272847
H  4.799383 2.009918 -0.347678
H  4.549964 -2.645504 0.043049
H  3.390999 -3.260665 1.288378
H  4.277672 -1.706075 1.571894
H  -6.247921 0.659632 0.839294
H  -7.1231 -0.056551 -0.588693
H  -6.031338 1.38669 -0.795179
