program: Gaussian 09
title: 000217076
version: EM64L-G09RevD.01
frameworkgroup: C1[X(C10H19N2O4PS3)]
method: RPBEPBE
basis: SDD
operation: Freq
keyword: #p
keyword: freq=noraman
keyword: PBEPBE/SDD
title: #p freq=noraman PBEPBE/SDD
converged: NO YES NO NO
title: Mulliken charges:
elementType: S S S P O O O O N N C C C C C C C C C C H H H H H H H H H H H H H H H H H H H
charge: 0.075877 0.302365 -0.225761 0.565337 -0.462683 -0.475754 -0.203648 -0.267097 -0.057280 -0.094053 -0.756016 -0.217606 -0.242858 0.010853 -0.269210 -0.261532 -0.650902 -0.636400 -0.089568 -0.496617 0.305312 0.323219 0.222614 0.235723 0.235446 0.233803 0.260421 0.227623 0.208061 0.191816 0.230072 0.233266 0.213902 0.238045 0.232942 0.214550 0.239467 0.200363 0.205909
chargesum: 0.00000
title: Mulliken charges with hydrogens summed into heavy atoms:
elementType: S S S P O O O O N N C C C C C C C C C C
charge: 0.075877 0.302365 -0.225761 0.565337 -0.462683 -0.475754 -0.203648 -0.267097 -0.057280 -0.094053 -0.127485 0.240730 0.226392 0.010853 0.218834 0.138345 0.026338 0.049136 -0.089568 0.149122
polarizability: 3.12806142e+02 1.85495965e+01 2.17220353e+02 1.44298574e+01 3.87450252e+00 1.65966285e+02
1716.lowfreq: -12.4558 -5.3873 -0.0010 0.0015 0.0020 1.9143 5.7782 18.5544 23.1610
frequency: -3.4430 18.5106 23.0677 24.0620 33.9971 40.5507 47.2249 58.9233 65.3574 72.2346 85.2394 90.9204 110.9500 119.0256 131.6462 135.2443 174.0593 185.4040 202.5840 211.6179 219.1641 233.2826 262.0015 265.6291 277.3819 284.8284 303.1343 321.8659 369.6757 379.4566 384.3880 399.9233 445.1755 478.7165 513.4994 546.3553 554.4467 569.9983 590.3301 646.4078 650.3906 684.1054 705.3654 753.7718 796.6411 798.8121 811.5750 838.8588 852.8694 868.0508 875.9752 986.8296 1004.2106 1007.9559 1019.3114 1021.7738 1063.9446 1091.2183 1103.7028 1104.7343 1108.4740 1122.3849 1133.5814 1141.1223 1157.6311 1159.0246 1200.8157 1227.4576 1250.3797 1252.0870 1253.2174 1268.8137 1338.0209 1348.9393 1351.2501 1388.7205 1393.4161 1395.4803 1418.0510 1428.5821 1437.6601 1450.8981 1457.5851 1457.6389 1459.1392 1459.2992 1460.5712 1462.5607 1476.3579 1477.3992 1477.8034 1488.5046 2919.7211 2929.5109 2977.2278 2981.5532 2990.0932 2995.9674 3001.3441 3005.4391 3025.9250 3045.8639 3046.7422 3080.5914 3089.8943 3092.3752 3098.9468 3108.7774 3109.7207 3111.9792 3126.0333
redmass: 4.3109 4.8027 3.9480 4.9884 5.1758 3.3990 5.3627 2.7170 2.6153 3.1298 4.7600 4.5867 6.2839 5.3539 3.1895 5.0534 4.2451 3.3504 3.6213 1.7651 1.7561 1.3784 2.1880 2.7171 3.0234 3.7953 3.3765 4.1338 5.2490 8.8818 5.0778 5.5773 4.9482 3.4146 7.3962 10.6776 6.8628 8.9998 12.2582 7.2303 7.3842 8.8207 6.8743 6.6534 2.8973 1.1229 1.0900 5.2085 3.9621 3.6542 1.9191 2.5199 2.3951 2.6939 3.8674 3.0517 2.8738 2.1958 2.2188 4.7546 1.6804 1.8898 1.4282 1.5389 1.4246 1.9632 1.1189 2.0614 1.2718 1.1365 1.1473 1.1143 1.5009 1.2158 1.2586 1.5086 1.2266 1.2389 1.3209 1.9108 1.1652 2.5103 1.0916 1.1804 1.0579 1.0457 1.5952 1.0684 1.0548 1.0674 1.0551 1.0792 1.0509 1.0416 1.1010 1.0560 1.0363 1.0368 1.1028 1.0631 1.0590 1.0843 1.0803 1.1010 1.0982 1.0982 1.1073 1.1020 1.0970 1.1032 1.1069
irintensity: 0.4335 0.2414 0.9575 0.4835 0.3946 0.5376 1.6469 1.2231 3.5721 5.7225 0.9837 6.9283 2.6671 0.1042 2.5343 2.7712 2.9681 4.3737 2.4445 3.1078 5.3185 1.0840 5.3125 7.6918 9.0585 2.0839 4.7203 7.0120 6.5493 0.5790 0.0856 16.3878 38.8129 5.0224 17.1081 155.9662 2.4726 27.4873 4.9972 56.6071 71.5164 109.8045 4.0560 2.6929 11.3596 2.9806 2.7138 60.0270 151.1043 89.1365 12.4397 15.3593 62.7960 155.1958 123.4741 35.0193 78.3681 7.0081 7.1881 60.1954 18.2966 19.6559 4.6950 4.3494 16.3996 58.7628 10.6113 39.2449 28.2711 14.9598 1.3407 0.4682 196.8317 12.4988 7.2511 25.7728 29.2593 30.3457 14.3376 365.2664 1.4636 7.8324 40.1469 52.6538 11.4276 15.1558 53.7736 6.0350 16.1276 6.3760 4.8406 11.2416 50.5388 111.4302 49.9843 29.0764 15.3085 24.5988 67.5935 25.2672 28.9469 3.9437 8.6777 10.8349 23.3839 24.9308 13.7320 29.2021 25.3798 26.1189 4.9666
temp: 298.150 k
press: 1.00000 atm
elementType: 16 16 16 15 8 8 8 8 7 7 6 6 6 6 6 6 6 6 6 6 1 1 1 1 1 1 1 1 1 1 1 1 1 1 1 1 1 1 1
symmnumber: 1
zpe: 768941.3 jmol-1
zpe.correction: 0.292874 hartree
zpe.thermalcorrener: 0.318057 hartree
zpe.thermalcorrenthalpy: 0.319001 hartree
zpe.thermalcorrgfe: 0.232834 hartree
zpe.sumelectzpe: -2336.606221 hartree
zpe.sumelectthermal: -2336.581038 hartree
zpe.sumelectthermalent: -2336.580094 hartree
zpe.sumelectthermalfe: -2336.666261 hartree
dipole: -1.3308 1.4350 -4.7472
dipole: 5.1348
quadrupole: -108.0056 -148.5049 -155.3486
quadrupole: -16.2068 -1.0144 -2.3569
quadrupole: 29.2807 -11.2185 -18.0622 -16.2068 -1.0144 -2.3569
hfenergy: -2336.899095 hartree
pointgroup: C01 [X(C10H19N2O4P1S3)]
dipole: 0.6619809 -0.307196 -1.8837564 debye
polarizability: 308.2164289|29.8455791|222.9857858|-4.9160007|1.7324463|164.7905654 unknown
InChI: InChI=1S/C6H9N2O2S2.C4H10O2PS/c1-9-2-3-10-6-8-7-5(4-11)12-6;1-3-5-7(8)6-4-2/h2-4H2,1H3;3-4H2,1-2H3
charge 0 multiplicity 1
39 atoms
S  -2.056765 0.689361 1.782417
S  1.136652 -0.002674 -0.212862
S  -4.042976 -2.441037 1.607441
P  -2.991645 -1.001217 0.570443
O  -3.840779 -0.155284 -0.703667
O  -1.614403 -1.465759 -0.370307
O  3.847534 0.435783 -0.091619
O  6.452739 -0.440247 1.107106
N  1.043392 2.540183 0.638571
N  2.415007 2.250291 0.532125
C  -1.236782 1.644128 0.318995
C  -5.190846 0.399163 -0.384775
C  -1.561349 -2.840657 -0.958218
C  0.245862 1.527729 0.298251
C  5.023502 1.301673 0.253664
C  6.272632 0.484416 -0.009138
C  -5.715792 1.012804 -1.679352
C  -2.42393 -2.958678 -2.215544
C  2.628958 0.999391 0.108533
C  7.584686 -1.342099 0.903982
H  -1.507805 2.698835 0.482033
H  -1.720086 1.272096 -0.598002
H  -5.087624 1.156167 0.417258
H  -5.837573 -0.422752 -0.022904
H  -0.488064 -2.96323 -1.177442
H  -1.862618 -3.569504 -0.18142
H  4.946812 1.593085 1.315123
H  4.977087 2.20664 -0.378227
H  6.175207 -0.062621 -0.972486
H  7.143761 1.175175 -0.085486
H  -5.050856 1.819366 -2.032115
H  -5.791011 0.248694 -2.47132
H  -6.721327 1.439341 -1.507485
H  -3.495673 -2.841944 -1.978682
H  -2.143671 -2.190759 -2.955991
H  -2.276838 -3.956336 -2.670623
H  7.625705 -1.986867 1.795241
H  8.54155 -0.784461 0.808711
H  7.445528 -1.972192 -0.000126
