program: Gaussian 09
title: 000217030
version: EM64L-G09RevD.01
frameworkgroup: C1[X(C10H15N3O3S)]
method: RPBEPBE
basis: SDD
operation: Freq
keyword: #p
keyword: freq=noraman
keyword: PBEPBE/SDD
title: #p freq=noraman PBEPBE/SDD
converged: NO YES NO NO
title: Mulliken charges:
elementType: S O O O N N N C C C C C C C C C C H H H H H H H H H H H H H H H
charge: 0.982534 -0.572181 -0.513129 -0.508239 -0.140579 -0.062024 -0.092543 -0.388240 -0.373628 -0.373663 -0.358356 0.261490 -0.613442 -0.286623 -0.161416 -0.020836 -0.378916 0.223013 0.276660 0.203236 0.235206 0.199855 0.221601 0.220217 0.192368 0.193576 0.225515 0.228154 0.229437 0.285064 0.287611 0.378279
chargesum: 0.00000
title: Mulliken charges with hydrogens summed into heavy atoms:
elementType: S O O O N N N C C C C C C C C C C
charge: 0.982534 -0.193902 -0.513129 -0.508239 -0.140579 -0.062024 -0.092543 0.111432 0.064814 0.047793 0.054230 0.261490 0.033803 -0.057186 0.123648 -0.020836 -0.091305
polarizability: 2.87330551e+02 1.37637751e+00 1.49270878e+02 -1.00080614e+01 1.85532716e+00 1.12215069e+02
1716.lowfreq: -25.2094 -11.7661 -0.0015 -0.0009 0.0014 7.0942 11.0138 20.3517 56.6544
frequency: 3.9398 16.2236 56.4969 68.7436 93.6902 138.3429 153.3913 156.8936 167.4032 201.4860 219.7774 253.2794 272.1548 291.1815 309.5302 331.0568 336.7844 355.8378 366.7380 409.1827 418.2834 434.2024 467.9683 489.1655 501.7762 534.6585 560.9570 618.1928 624.5280 731.9809 740.5806 745.4420 812.1166 826.0942 837.0768 920.7327 929.2233 936.0646 947.3324 960.6569 970.8690 998.7901 1042.5828 1044.9354 1047.5263 1064.0168 1071.8264 1081.1579 1127.6461 1139.2727 1145.4424 1160.4114 1197.1137 1218.6697 1253.4424 1283.3500 1292.4598 1295.7345 1327.1845 1338.7341 1350.4261 1356.3817 1370.2478 1382.3849 1413.7691 1433.6467 1455.5311 1457.1554 1459.4541 1462.9998 1474.8629 1481.0172 1494.9006 1543.4675 1588.0410 2845.3701 2859.0713 2874.9411 2987.9530 2990.1931 3024.6444 3033.0197 3039.5896 3082.0215 3108.9929 3112.5116 3147.2754 3158.5063 3183.4107 3477.3348
redmass: 4.5211 5.3764 4.0632 5.0905 5.1580 6.0715 3.5449 3.6784 1.5052 5.6196 1.2022 2.2693 6.3595 3.1252 2.6188 2.4773 5.3832 6.5629 5.9191 2.1743 3.9174 7.1225 2.6011 3.8724 3.5139 5.1403 5.3549 7.5868 2.6291 5.2146 4.0167 3.3945 1.7116 12.6037 1.5986 2.6287 2.4950 1.4352 5.2593 13.5494 1.3497 2.5146 1.2104 2.0275 1.8028 1.7453 2.6648 1.6670 1.6719 2.6075 2.5436 1.6917 1.1201 1.9905 1.4330 1.7343 1.4233 1.6565 1.6437 1.5237 1.4392 1.3992 1.4868 2.9541 2.2120 1.1671 1.0928 1.0777 1.1565 1.0756 1.1042 1.0531 3.7082 5.6851 6.3017 1.0704 1.0667 1.0592 1.0676 1.0682 1.0742 1.0885 1.0903 1.1010 1.0937 1.0955 1.0930 1.0899 1.0954 1.0661
irintensity: 0.0856 1.7081 1.3927 1.8080 0.3688 1.0675 8.0284 1.5487 48.8179 9.2773 1.7950 10.9093 28.6758 59.8046 3.4882 2.9476 13.4165 5.3021 4.2290 4.0696 9.1969 70.5367 0.4406 7.5449 29.0687 75.5767 151.8435 10.1028 7.7157 2.4193 2.5488 7.2680 48.7079 95.5318 0.9631 9.0097 5.9304 12.9576 40.1672 83.7051 2.0433 76.7560 84.7641 17.6797 8.8852 11.2344 103.4077 7.1723 11.8766 4.0856 40.8618 16.9041 5.3607 2.6463 104.5456 18.6269 40.4742 43.0110 5.2336 5.7795 6.5602 20.3722 21.8070 31.8463 27.7125 2.7264 21.0680 1.9569 92.2971 5.7689 15.8497 9.4544 102.9002 48.5801 660.4244 54.0608 41.7926 184.5826 9.5128 89.2061 48.3580 52.7223 57.4377 29.7746 17.1582 4.9624 0.2991 2.3519 12.1454 36.9046
temp: 298.150 k
press: 1.00000 atm
elementType: 16 8 8 8 7 7 7 6 6 6 6 6 6 6 6 6 6 1 1 1 1 1 1 1 1 1 1 1 1 1 1 1
symmnumber: 1
zpe: 651901.7 jmol-1
zpe.correction: 0.248296 hartree
zpe.thermalcorrener: 0.265735 hartree
zpe.thermalcorrenthalpy: 0.266679 hartree
zpe.thermalcorrgfe: 0.199779 hartree
zpe.sumelectzpe: -1176.549391 hartree
zpe.sumelectthermal: -1176.531952 hartree
zpe.sumelectthermalent: -1176.531008 hartree
zpe.sumelectthermalfe: -1176.597908 hartree
dipole: 7.5485 1.7253 1.5213
dipole: 7.8912
quadrupole: -116.8717 -105.9791 -110.2303
quadrupole: 2.0097 -6.1988 -1.4611
quadrupole: -5.8446 5.0479 0.7967 2.0097 -6.1988 -1.4611
hfenergy: -1176.797687 hartree
pointgroup: C01 [X(C10H15N3O3S1)]
dipole: -2.9876605 0.8079622 -0.2444347 debye
polarizability: 285.1790604|0.142399|148.4472751|-21.7175953|5.8329342|115.1901624 unknown
InChI: InChI=1S/C10H15N3O3S/c1-12-4-6-13(7-5-12)10-3-2-9(8-11-10)17(14,15)16/h2-3,8,14H,4-7H2,1H3
charge 0 multiplicity 1
32 atoms
S  4.118796 -0.084313 -0.514833
O  3.963451 0.123874 -2.366483
O  4.882699 1.219585 0.073978
O  4.693413 -1.572001 -0.229792
N  -1.742096 0.027608 0.699199
N  -4.52992 -0.03708 -0.023109
N  0.219619 -1.135115 0.14827
C  -2.492315 -1.250866 0.712547
C  -2.603948 1.202418 0.935991
C  -3.651799 -1.200437 -0.29979
C  -3.763621 1.226975 -0.084475
C  -0.387273 0.076686 0.437872
C  -5.731546 -0.013106 -0.879641
C  0.376589 1.2991 0.471322
C  1.742363 1.257751 0.174114
C  2.319168 0.006668 -0.133901
C  1.541556 -1.166181 -0.130559
H  -2.906894 -1.404867 1.728468
H  -1.789929 -2.062369 0.474379
H  -2.030199 2.137395 0.859836
H  -3.02938 1.135794 1.95703
H  -3.231565 -1.165934 -1.337423
H  -4.250306 -2.125399 -0.207033
H  -4.440179 2.06644 0.162181
H  -3.342649 1.413486 -1.106769
H  -5.498026 0.095545 -1.968364
H  -6.383275 0.828032 -0.582972
H  -6.300628 -0.94974 -0.7436
H  -0.08022 2.255641 0.731355
H  2.357281 2.16286 0.196712
H  1.983932 -2.144425 -0.34545
H  4.888003 0.067072 -2.747761
