program: Gaussian 09
title: 000015261
version: EM64L-G09RevD.01
frameworkgroup: C1[X(C9H16O2)]
method: RPBEPBE
basis: SDD
operation: Freq
keyword: #pfreq=noraman
keyword: PBEPBE/SDD
title: #p freq=noraman PBEPBE/SDD
converged: YES YES NO NO
title: Mulliken charges:
elementType: O O C C C C C C C C C H H H H H H H H H H H H H H H H
charge: -0.461596 -0.427394 0.192559 -0.375287 -0.367768 -0.722162 -0.699414 -0.017965 -0.523076 0.000898 -0.303742 0.187783 0.205503 0.236159 0.205441 0.232432 0.219106 0.216404 0.204774 0.210355 0.216472 0.340985 0.236890 0.235614 0.229241 0.194490 0.333300
chargesum: 0.00000
title: Mulliken charges with hydrogens summed into heavy atoms:
elementType: O O C C C C C C C C C
charge: -0.120612 -0.094095 0.192559 0.017999 0.073832 -0.054220 -0.067813 -0.017965 -0.050572 0.000898 0.119989
polarizability: 1.28890538e+02 8.99339748e+00 1.01122639e+02 3.58593951e+00 9.87588705e-01 8.57427391e+01
1716.lowfreq: -0.0010 -0.0002 0.0003 6.9547 8.4337 15.7103 22.5925 45.4279 71.5689
frequency: 17.6543 45.3584 71.5588 73.7648 102.6134 123.6057 168.6503 188.0893 233.0714 238.7071 276.1669 299.0940 313.1018 320.8660 340.5005 353.0071 368.3309 407.0251 506.2283 564.1257 583.9976 635.9646 744.4255 803.7635 834.9285 867.6042 879.8167 916.9985 951.8262 989.7446 1019.7323 1035.0299 1043.4422 1068.4679 1091.2809 1111.8804 1138.8241 1140.7642 1201.2469 1229.5103 1241.6764 1286.1135 1301.4622 1316.2838 1323.0689 1342.6514 1355.7925 1379.8255 1380.9750 1387.2173 1446.3965 1447.5093 1462.7755 1468.2869 1470.7137 1476.0482 1478.9463 1486.6145 2271.6837 2953.3862 2966.6088 2968.9688 2979.9262 2984.2503 2991.7062 3009.4763 3032.1698 3049.2717 3069.7215 3075.4871 3083.4091 3094.5027 3094.8517 3549.6018 3560.5295
redmass: 4.2113 4.0920 3.2793 2.0421 2.8191 2.7982 2.4152 2.8078 1.0699 1.1242 2.8169 1.1385 1.6026 2.2468 2.9399 2.9533 2.8713 4.4773 3.3873 5.0997 4.0799 2.8969 1.2070 2.6309 2.5295 1.7484 1.5107 2.0044 1.8529 1.9610 2.0075 2.0515 2.0464 2.8690 1.8888 1.9577 2.0960 1.1906 2.2282 1.1489 1.3511 1.2957 1.2598 1.3338 1.6188 1.4336 1.5510 1.2184 1.2181 1.2131 1.0800 1.0896 1.0583 1.0581 1.0806 1.0486 1.0427 1.0841 11.8185 1.0639 1.0652 1.0358 1.0553 1.0385 1.0626 1.0985 1.0974 1.1011 1.0989 1.1022 1.0998 1.0958 1.1004 1.0661 1.0662
irintensity: 1.4443 1.5757 1.5563 0.5589 2.8341 1.6299 9.4455 0.7255 0.1862 3.1717 27.7703 160.0308 81.3816 49.5051 16.0699 5.0915 15.9264 3.2685 24.1497 3.2517 4.4957 17.2517 3.5619 28.0813 14.9665 2.4345 5.1815 4.5008 16.9919 72.5511 37.1867 3.5881 21.3964 7.7096 25.5594 13.6880 27.6319 27.9414 17.7360 4.4407 1.6586 5.8522 9.4314 3.6888 61.9330 31.8123 6.1047 20.1473 11.0627 10.8921 4.0430 7.3804 13.0159 3.2976 4.6762 2.6660 11.7696 13.4322 5.2866 25.0416 121.6144 39.6014 9.9602 24.6810 38.9526 19.7031 10.2759 0.3239 49.6543 71.4393 36.7040 17.3979 42.1035 6.3969 4.6290
temp: 298.150 k
press: 1.00000 atm
elementType: 8 8 6 6 6 6 6 6 6 6 6 1 1 1 1 1 1 1 1 1 1 1 1 1 1 1 1
symmnumber: 1
zpe: 604644.6 jmol-1
zpe.correction: 0.230297 hartree
zpe.thermalcorrener: 0.244725 hartree
zpe.thermalcorrenthalpy: 0.245669 hartree
zpe.thermalcorrgfe: 0.187902 hartree
zpe.sumelectzpe: -502.033285 hartree
zpe.sumelectthermal: -502.018857 hartree
zpe.sumelectthermalent: -502.017913 hartree
zpe.sumelectthermalfe: -502.075680 hartree
dipole: -1.9530 -1.0007 -2.5848
dipole: 3.3907
quadrupole: -64.1735 -64.5340 -68.9716
quadrupole: 4.7473 4.7504 -1.9375
quadrupole: 1.7195 1.3591 -3.0786 4.7473 4.7504 -1.9375
hfenergy: -502.2635817 hartree
pointgroup: C01 [X(C9H16O2)]
dipole: 0.7816805 0.3914194 -1.0076408 debye
polarizability: 129.4313507|8.1916359|100.6224031|-3.3767904|-0.5444143|85.702162 unknown
InChI: InChI=1S/C9H16O2/c1-3-6-9(2,11)7-4-5-8-10/h10-11H,3,5-6,8H2,1-2H3
charge 0 multiplicity 1
27 atoms
O  -1.117528 -1.286303 1.382065
O  3.980858 -0.595563 0.458809
C  -1.010219 -0.954718 -0.072194
C  -2.302963 -0.158485 -0.385976
C  -2.445865 1.168033 0.388317
C  -0.962675 -2.272867 -0.885955
C  -3.772135 1.887163 0.061936
C  0.221244 -0.163988 -0.313336
C  2.559439 1.148611 -0.679493
C  1.2812 0.441932 -0.496151
C  3.609142 0.820851 0.416586
H  -2.335515 0.035108 -1.476547
H  -3.155563 -0.822715 -0.141811
H  -2.382765 0.954123 1.470721
H  -1.591694 1.829006 0.142686
H  -1.855432 -2.87672 -0.646806
H  -0.060233 -2.85937 -0.6358
H  -0.947826 -2.067895 -1.971484
H  -3.843507 2.127979 -1.01623
H  -4.642407 1.255125 0.32241
H  -3.863804 2.833872 0.625487
H  -0.249236 -1.666344 1.675292
H  2.985185 0.905512 -1.675666
H  2.387708 2.244431 -0.673229
H  3.192797 1.027745 1.415111
H  4.501482 1.46392 0.258548
H  4.331611 -0.866143 -0.427286
