program: Gaussian 09
title: 000217037
version: EM64L-G09RevD.01
frameworkgroup: C1[X(C12H20N4O2S)]
method: RPBEPBE
basis: SDD
operation: Freq
keyword: #p
keyword: freq=noraman
keyword: PBEPBE/SDD
title: #p freq=noraman PBEPBE/SDD
converged: YES YES NO NO
title: Mulliken charges:
elementType: S O O N N N N C C C C C C C C C C C C H H H H H H H H H H H H H H H H H H H H
charge: 0.887137 -0.536732 -0.535775 -0.192840 -0.055733 -0.042373 -0.473260 -0.360062 -0.426249 -0.383035 -0.373157 0.246305 -0.612144 -0.128828 -0.177597 -0.342333 -0.189740 -0.363562 -0.656174 0.233736 0.231371 0.228030 0.287065 0.219041 0.174549 0.181741 0.225857 0.187584 0.224965 0.227640 0.303517 0.318935 0.243566 0.247460 0.241117 0.260970 0.259530 0.199711 0.219768
chargesum: 0.00000
title: Mulliken charges with hydrogens summed into heavy atoms:
elementType: S O O N N N N C C C C C C C C C C C C
charge: 0.887137 -0.536732 -0.535775 -0.192840 -0.055733 -0.042373 -0.154325 0.105045 0.088846 0.010554 0.034441 0.246305 0.028045 -0.128828 0.125919 -0.094872 0.053826 0.138525 0.022835
polarizability: 2.31712503e+02 1.73201841e+01 2.12868061e+02 -6.72978418e-02 7.69810948e+00 1.38818491e+02
1716.lowfreq: -11.5903 -7.6929 0.0014 0.0015 0.0015 4.9153 19.7236 34.8271 43.7177
frequency: 19.1572 34.5309 43.5999 52.8264 84.1919 93.3833 107.3145 136.9865 149.2471 173.0319 191.1103 201.1573 218.6266 229.3448 240.3339 260.8630 271.2390 288.7030 320.8840 329.6574 344.7387 365.2819 391.4477 403.6672 421.6061 471.5884 476.9128 495.5515 510.0451 521.6250 557.0726 611.0197 652.7059 736.0991 748.3979 753.8253 760.3165 794.1173 802.7743 836.0771 845.6635 876.6517 916.5992 929.2158 934.8602 943.6537 956.5528 973.3407 1006.4581 1043.5848 1045.2659 1048.5962 1067.7572 1077.5699 1079.0159 1085.9513 1112.1119 1123.4282 1126.6928 1140.2802 1148.3595 1195.2237 1202.5525 1233.1247 1245.7925 1255.0399 1284.8327 1291.2946 1304.4103 1314.1991 1341.3291 1345.2888 1356.3009 1365.6334 1375.0380 1381.9063 1394.9189 1406.4196 1429.8404 1445.6390 1451.5860 1452.7643 1458.6275 1460.5180 1468.8836 1470.6934 1475.7536 1479.1485 1480.4131 1521.3069 1578.3816 2818.1047 2833.2120 2860.4193 2952.9505 2978.2208 2979.8567 2994.6793 3021.8861 3031.5455 3040.3230 3051.4184 3076.7512 3077.4563 3080.4021 3091.1332 3094.4491 3135.3617 3143.9510 3180.1831 3308.4154
redmass: 3.5998 3.4145 4.2155 3.2342 4.3840 4.3564 3.2122 4.0313 3.1405 3.8427 2.9108 3.9955 2.5761 1.6886 1.5296 4.9053 2.5444 3.7682 2.7546 3.1655 2.8459 4.8283 2.5102 2.2453 5.4221 3.0312 4.5446 5.2288 4.3140 3.9109 3.3995 4.8112 3.2433 5.1372 1.6472 2.1892 5.1214 3.6517 1.3439 1.8880 1.5689 2.1639 7.3872 2.2145 3.9614 1.4345 5.6306 1.4142 2.4725 3.1903 2.0564 1.8401 1.8421 1.7655 1.8524 1.7691 1.9917 1.7255 1.6603 2.6291 2.7002 1.2143 1.4335 2.0551 1.6603 1.1872 1.5079 1.5280 1.2283 3.7676 1.3471 1.4721 1.5662 1.2222 1.5084 1.3838 1.2022 1.9198 1.1783 2.5727 1.0716 1.0795 1.0939 1.0867 1.0436 1.1007 1.1322 1.0529 1.0547 6.0680 6.7397 1.0708 1.0686 1.0579 1.0669 1.0365 1.0671 1.0631 1.0727 1.0875 1.0886 1.0995 1.0991 1.0975 1.1011 1.0955 1.1012 1.0896 1.0918 1.0986 1.0753
irintensity: 1.5675 0.6777 0.9423 1.1672 3.0000 3.1135 1.0977 1.9875 5.2720 3.3587 1.2484 12.3948 5.8842 1.8042 1.2860 3.0930 4.7413 12.7608 3.1978 12.1755 1.3873 2.2952 17.8458 19.0232 14.4369 6.3140 7.7298 39.8026 34.1897 6.0425 4.6397 7.6280 2.1232 1.7250 40.1241 45.4847 18.5069 107.2375 37.8461 22.7906 0.3260 2.2115 92.5986 1.1662 42.8236 1.2040 13.4755 2.2282 39.8949 19.1893 2.3289 14.7253 5.0568 2.3413 2.9527 5.8189 10.6726 28.5869 21.7123 17.4495 47.3149 6.0949 5.5403 8.7302 84.3501 11.5992 26.2825 32.6988 7.6871 7.6113 18.9875 3.6709 3.3830 29.0223 0.8381 18.2825 18.1256 15.5021 0.7455 244.6550 11.9603 2.5797 3.4110 7.2184 15.6578 35.5662 7.7674 15.9840 5.7342 25.2241 139.9726 54.0640 109.2924 179.6438 71.9894 24.2249 37.1335 17.2736 49.1817 51.5219 39.1334 0.5717 38.8579 17.3790 28.4691 14.1573 17.0372 20.9071 4.1181 16.9337 28.7116
temp: 298.150 k
press: 1.00000 atm
elementType: 16 8 8 7 7 7 7 6 6 6 6 6 6 6 6 6 6 6 6 1 1 1 1 1 1 1 1 1 1 1 1 1 1 1 1 1 1 1 1
symmnumber: 1
zpe: 830209.8 jmol-1
zpe.correction: 0.316210 hartree
zpe.thermalcorrener: 0.336312 hartree
zpe.thermalcorrenthalpy: 0.337257 hartree
zpe.thermalcorrgfe: 0.266649 hartree
zpe.sumelectzpe: -1235.110767 hartree
zpe.sumelectthermal: -1235.090665 hartree
zpe.sumelectthermalent: -1235.089721 hartree
zpe.sumelectthermalfe: -1235.160329 hartree
dipole: 2.7892 -1.7309 -2.6587
dipole: 4.2243
quadrupole: -116.4228 -119.2595 -126.1806
quadrupole: 15.8430 -0.2123 -5.8880
quadrupole: 4.1982 1.3614 -5.5596 15.8430 -0.2123 -5.8880
hfenergy: -1235.4269775 hartree
pointgroup: C01 [X(C12H20N4O2S1)]
dipole: -1.005794 -0.1270525 1.316951 debye
polarizability: 215.4790131|-23.1892377|221.9821141|-15.5649627|-14.6187672|145.9379274 unknown
InChI: InChI=1S/C12H20N4O2S/c1-3-14-19(17,18)11-5-4-6-13-12(11)16-9-7-15(2)8-10-16/h4-6,14H,3,7-10H2,1-2H3
charge 0 multiplicity 1
39 atoms
S  1.986356 0.597243 -0.919671
O  3.598328 0.697812 -1.115028
O  1.060366 1.105023 -2.174245
N  -0.77001 -0.735474 0.340445
N  -3.317977 0.627727 0.394853
N  0.300809 -2.79002 0.896491
N  1.618263 1.435239 0.699626
C  -1.781694 -1.059461 1.384422
C  -1.43365 -0.295547 -0.930842
C  -2.653635 0.181342 1.638827
C  -2.320418 0.925925 -0.657131
C  0.360298 -1.57131 0.267148
C  -4.258277 1.74154 0.619074
C  1.582929 -1.19316 -0.364608
C  2.675159 -2.063572 -0.447653
C  1.367494 -3.633183 0.841492
C  2.559353 -3.344943 0.142494
C  2.075147 2.852803 0.745788
C  1.210317 3.866165 -0.034859
H  -1.260006 -1.364668 2.305438
H  -2.418253 -1.907336 1.059134
H  -2.065154 -1.128495 -1.30763
H  -0.676075 -0.035316 -1.686521
H  -3.428888 -0.072984 2.385459
H  -2.011331 0.991688 2.078227
H  -1.665459 1.793382 -0.37607
H  -2.85039 1.198987 -1.587863
H  -3.76058 2.673198 0.991331
H  -5.020949 1.44164 1.359765
H  -4.776281 1.985999 -0.325276
H  3.606775 -1.715154 -0.907894
H  0.59689 1.299391 0.851526
H  3.380435 -4.065229 0.103778
H  1.249368 -4.577669 1.384788
H  2.108262 3.105823 1.823535
H  3.120326 2.862585 0.386003
H  1.184428 3.612935 -1.108993
H  0.169857 3.879105 0.342039
H  1.62397 4.885372 0.074298
