program: Gaussian 09
title: 000217010
version: EM64L-G09RevD.01
frameworkgroup: C1[X(C13H15N3)]
method: RPBEPBE
basis: SDD
operation: Freq
keyword: #pfreq=noraman
keyword: PBEPBE/SDD
title: #p freq=noraman PBEPBE/SDD
converged: YES YES NO NO
title: Mulliken charges:
elementType: N N N C C C C C C C C C C C C C H H H H H H H H H H H H H H H
charge: -0.158056 -0.107303 -0.644922 -0.455739 -0.454832 -0.375127 -0.356615 0.208878 -0.521473 0.461143 0.171696 -0.011924 -0.426636 -0.347914 -0.239153 -0.279872 0.225419 0.222397 0.224922 0.220289 0.217508 0.227353 0.217805 0.246168 0.237647 0.227614 0.190404 0.221910 0.222864 0.320879 0.314669
chargesum: 0.00000
title: Mulliken charges with hydrogens summed into heavy atoms:
elementType: N N N C C C C C C C C C C C C C
charge: -0.158056 -0.107303 -0.009373 -0.007924 -0.009621 0.069733 0.107359 0.208878 -0.283827 0.461143 0.171696 -0.011924 -0.199021 -0.157510 -0.017243 -0.057008
polarizability: 2.71130925e+02 -6.82005040e+00 1.75038353e+02 1.18593616e+00 -1.30653580e+00 8.07024318e+01
1716.lowfreq: -7.7824 -0.0010 -0.0009 -0.0006 4.4946 13.6512 42.3011 71.7965 89.7577
frequency: 42.2514 71.7508 89.7575 120.0242 147.6628 182.8516 233.2033 244.4471 271.1623 284.8988 304.8881 307.6030 351.5775 418.9913 483.2386 512.7311 524.2740 527.8091 563.5701 572.4576 590.6176 657.9315 683.6732 701.7401 733.8011 737.8231 787.9639 798.7610 828.2986 858.8119 863.2432 867.6969 894.4008 913.3431 923.3150 934.0755 958.0910 977.5237 979.8024 1025.3233 1057.3353 1094.6469 1113.1512 1125.4895 1147.4784 1156.8637 1169.9192 1175.4612 1192.9606 1216.4986 1230.7828 1240.5778 1267.7811 1299.9877 1310.1435 1325.8985 1337.0913 1372.0698 1376.1946 1396.4082 1422.0649 1446.4379 1466.8118 1471.4458 1478.8697 1495.3539 1502.2234 1506.4146 1566.5639 1585.2274 1616.1427 1627.1789 2935.0873 2964.3723 2992.5970 3007.1886 3013.5705 3061.0458 3074.3945 3088.2217 3109.3577 3118.4584 3138.3237 3159.1236 3161.7623 3562.8666 3719.5784
redmass: 3.7198 2.8174 3.1651 4.0477 2.8381 3.4342 2.1252 3.1460 4.1825 4.0812 3.8845 1.3517 3.6450 2.3203 6.9124 1.2259 3.2464 5.6847 2.9110 2.3437 5.7837 3.9425 3.6632 3.8697 1.8067 2.3855 2.7192 1.5901 2.5373 1.9662 1.8205 2.2471 4.9308 2.4514 1.4309 1.3891 2.4267 1.6815 1.3331 2.4307 1.8929 3.0510 1.6306 1.8288 1.6375 1.3763 1.4355 1.2309 2.4286 1.3229 1.6220 1.4232 1.6654 1.3504 1.2397 1.6468 1.4621 4.2745 2.3247 2.8876 5.5323 4.4546 1.0889 1.2289 2.9296 1.0947 1.1228 3.4880 5.5932 4.8698 1.4506 6.6095 1.0637 1.0697 1.0924 1.0624 1.0692 1.0935 1.1008 1.1054 1.0863 1.0870 1.0943 1.0992 1.0918 1.0450 1.1036
irintensity: 0.7320 0.6403 2.4991 2.0481 13.3389 1.3967 0.1843 0.8090 0.4068 0.0597 10.1516 127.9249 4.4708 63.5120 0.1890 38.8752 40.4891 3.0200 2.7236 0.7385 3.2565 18.4105 17.4434 0.8676 16.3667 12.2506 16.3872 61.2817 1.8341 7.5491 13.8699 5.2345 0.8536 9.6026 1.6881 2.7447 10.2353 3.5239 0.4924 17.4335 1.4928 2.5614 8.1952 1.7841 8.7470 1.9156 13.8686 1.3535 7.3429 29.5079 15.7369 11.7649 1.8261 3.5415 0.0903 7.2185 26.9546 21.0942 79.6099 67.6951 7.7940 116.6374 9.0450 117.6979 160.4736 4.1309 28.0291 39.8292 126.9737 538.0525 328.7221 297.7648 66.4817 62.7906 15.2517 37.0699 64.4674 26.2699 44.5012 64.1571 16.5291 2.1900 36.7005 44.5255 9.4699 64.8167 25.7919
temp: 298.150 k
press: 1.00000 atm
elementType: 7 7 7 6 6 6 6 6 6 6 6 6 6 6 6 6 1 1 1 1 1 1 1 1 1 1 1 1 1 1 1
symmnumber: 1
zpe: 675105.4 jmol-1
zpe.correction: 0.257134 hartree
zpe.thermalcorrener: 0.270772 hartree
zpe.thermalcorrenthalpy: 0.271716 hartree
zpe.thermalcorrgfe: 0.216812 hartree
zpe.sumelectzpe: -667.508876 hartree
zpe.sumelectthermal: -667.495238 hartree
zpe.sumelectthermalent: -667.494294 hartree
zpe.sumelectthermalfe: -667.549197 hartree
dipole: -1.3324 0.7342 0.0419
dipole: 1.5219
quadrupole: -78.0126 -79.9187 -100.1339
quadrupole: 6.6825 -0.0299 -0.2255
quadrupole: 8.0092 6.1030 -14.1122 6.6825 -0.0299 -0.2255
hfenergy: -667.7660097 hartree
pointgroup: C01 [X(C13H15N3)]
dipole: 0.5261855 -0.2852761 0.0162087 debye
polarizability: 271.1905287|-6.2133273|174.9720343|-2.4204867|0.2539407|80.7091475 unknown
InChI: InChI=1S/C13H15N3/c14-13-11-6-2-1-5-10(11)9-12(15-13)16-7-3-4-8-16/h1-2,5-6,9H,3-4,7-8,14H2
charge 0 multiplicity 1
31 atoms
N  2.281008 0.142695 -0.034466
N  0.44883 -1.310285 -0.015598
N  -1.247137 -2.883155 0.002647
C  4.454591 1.072478 -0.29303
C  4.571007 -0.333279 0.353582
C  2.967363 1.448742 -0.074026
C  3.220246 -1.002066 0.006738
C  0.905683 0.000492 -0.011452
C  0.024209 1.107232 0.015865
C  -1.381795 0.870191 0.031671
C  -1.881089 -0.490503 0.024094
C  -0.878586 -1.546467 0.004344
C  -2.342045 1.941056 0.057557
C  -3.289028 -0.726987 0.037887
C  -3.713757 1.681181 0.072649
C  -4.199957 0.336147 0.062003
H  5.141838 1.812419 0.151027
H  4.670556 1.009398 -1.375468
H  5.432798 -0.908931 -0.024931
H  4.675285 -0.23881 1.45038
H  2.823025 2.003605 0.878362
H  2.573728 2.083719 -0.892436
H  3.25609 -1.517576 -0.974913
H  2.890414 -1.744595 0.752326
H  0.399332 2.133521 0.033606
H  -1.975448 2.97468 0.064878
H  -3.682174 -1.751539 0.029067
H  -4.427691 2.512854 0.092139
H  -5.277883 0.142902 0.072821
H  -0.501055 -3.574189 -0.017134
H  -2.215658 -3.18213 0.020609
