program: Gaussian 09
title: 000217008
version: EM64L-G09RevD.01
frameworkgroup: C1[X(C13H17N3)]
method: RPBEPBE
basis: SDD
operation: Freq
keyword: #pfreq=noraman
keyword: PBEPBE/SDD
title: #p freq=noraman PBEPBE/SDD
converged: YES YES NO NO
title: Mulliken charges:
elementType: N N N C C C C C C C C C C C C C H H H H H H H H H H H H H H H H H
charge: -0.144985 -0.119450 -0.645055 0.246834 -0.386929 -0.359062 0.451001 -0.517912 0.173700 -0.019984 -0.667702 -0.670164 -0.427774 -0.347795 -0.238638 -0.279428 0.223619 0.221014 0.248706 0.199438 0.231382 0.217694 0.241816 0.210617 0.204613 0.248852 0.206431 0.227423 0.190854 0.222414 0.223276 0.319888 0.315308
chargesum: 0.00000
title: Mulliken charges with hydrogens summed into heavy atoms:
elementType: N N N C C C C C C C C C C C C C
charge: -0.144985 -0.119450 -0.009860 0.246834 0.057703 0.089083 0.451001 -0.286530 0.173700 -0.019984 0.002425 -0.010269 -0.200352 -0.156941 -0.016224 -0.056152
polarizability: 2.66558199e+02 -4.93548011e+00 1.80218057e+02 2.02346896e+00 -9.69774496e+00 8.81605450e+01
1716.lowfreq: -15.0630 -8.9991 -0.0005 0.0006 0.0007 4.8537 43.6871 49.0258 66.1468
frequency: 43.5843 48.9919 66.1199 82.2374 97.6649 155.3615 180.1554 214.3361 222.7645 240.6914 270.3648 283.6703 299.7250 306.0342 351.2642 366.9185 416.7319 465.4728 486.0243 504.1132 509.5931 524.6480 565.7415 578.6885 615.4177 658.4752 684.8263 726.6450 733.4978 767.6805 781.7132 787.6378 796.4399 823.8664 861.7069 886.0444 920.3090 933.6700 934.5051 979.2849 1008.3456 1025.3226 1073.3831 1076.2906 1087.3668 1095.4770 1102.8835 1142.1844 1172.5190 1178.6874 1216.9295 1227.1402 1266.2191 1289.5737 1304.8211 1341.0051 1358.0005 1367.5359 1376.2938 1382.5940 1385.7392 1397.7738 1425.6927 1446.4149 1447.4813 1465.2150 1466.5811 1471.3906 1482.7488 1485.7224 1497.3604 1509.3657 1568.3998 1580.2698 1618.0322 1626.9050 2976.8631 2981.3849 2983.8984 2992.0910 3036.0542 3062.7800 3076.9220 3081.9551 3090.9101 3098.3106 3109.1694 3118.6259 3138.6692 3159.6684 3165.2624 3563.0566 3718.9508
redmass: 3.6825 3.3098 2.8228 2.9637 3.2086 3.3064 2.0009 1.0609 4.9197 1.3904 3.7076 3.0114 2.3241 1.5934 2.6931 2.9601 2.3108 3.8914 3.1102 4.3743 1.2405 3.2403 4.9040 3.4654 4.9542 4.0610 3.7073 4.1273 1.4876 1.3041 1.2587 2.4266 1.5893 2.6282 1.8285 4.2114 2.4212 1.4182 2.1842 1.3319 2.6703 2.4420 2.1378 2.0232 2.3795 1.6975 2.1475 1.8045 1.2160 1.3813 2.4680 1.7124 1.7237 1.3257 1.4412 1.2862 1.3039 4.4171 1.2844 1.4433 1.5777 2.5294 5.5914 3.2380 1.4119 1.0490 1.0507 1.4180 1.0568 1.1990 1.6299 2.4190 5.6762 4.8268 1.4129 6.6183 1.0362 1.0367 1.0600 1.0656 1.1020 1.0985 1.0994 1.0957 1.1009 1.1014 1.0864 1.0870 1.0942 1.0998 1.0910 1.0450 1.1037
irintensity: 0.0204 0.2136 0.0189 1.9372 6.5163 5.1016 1.4729 0.6028 5.6074 0.5362 0.2657 4.0448 36.5517 95.4503 1.1851 3.9805 60.4158 3.4218 0.6641 2.6600 38.7361 42.9265 0.9435 2.0832 4.5291 18.4345 16.4127 0.6282 26.6443 18.0996 7.9443 17.5713 57.9865 5.6120 14.3529 1.0661 4.5214 2.1032 1.9223 0.4200 15.5982 23.7962 12.5432 6.7491 41.1952 13.9446 17.6666 2.1953 22.0719 15.1773 19.4324 47.8214 11.4161 20.4798 43.7399 24.5645 53.9305 5.7534 32.2463 28.1391 29.4359 62.5715 8.8473 120.2987 19.8833 5.1239 18.4489 50.4565 8.3152 35.8508 76.3040 18.5160 161.0251 472.7093 332.1819 278.4218 37.9738 35.2715 42.4658 77.9061 15.0379 19.9284 44.2748 41.4696 38.4875 38.7926 16.7584 2.0511 35.8707 41.0404 14.2825 64.3335 25.6789
temp: 298.150 k
press: 1.00000 atm
elementType: 7 7 7 6 6 6 6 6 6 6 6 6 6 6 6 6 1 1 1 1 1 1 1 1 1 1 1 1 1 1 1 1 1
symmnumber: 1
zpe: 726700.6 jmol-1
zpe.correction: 0.276786 hartree
zpe.thermalcorrener: 0.292380 hartree
zpe.thermalcorrenthalpy: 0.293324 hartree
zpe.thermalcorrgfe: 0.233984 hartree
zpe.sumelectzpe: -668.680995 hartree
zpe.sumelectthermal: -668.665401 hartree
zpe.sumelectthermalent: -668.664457 hartree
zpe.sumelectthermalfe: -668.723797 hartree
dipole: -0.7956 0.7255 -0.1973
dipole: 1.0947
quadrupole: -82.4492 -81.1447 -101.8908
quadrupole: 6.5444 -0.6425 -3.8939
quadrupole: 6.0457 7.3502 -13.3959 6.5444 -0.6425 -3.8939
hfenergy: -668.957781 hartree
pointgroup: C01 [X(C13H17N3)]
dipole: 0.3208928 -0.2784177 -0.0706748 debye
polarizability: 266.7501136|-2.4548686|180.4975375|-2.9885983|6.8853111|87.6891495 unknown
InChI: InChI=1S/C13H17N3/c1-3-16(4-2)12-9-10-7-5-6-8-11(10)13(14)15-12/h5-9H,3-4,14H2,1-2H3
charge 0 multiplicity 1
33 atoms
N  2.415636 0.276079 0.003649
N  0.64251 -1.253093 -0.185599
N  -0.964373 -2.905692 -0.386412
C  1.037242 0.066486 -0.015582
C  2.98363 1.606701 0.278038
C  3.35631 -0.841606 -0.223869
C  -1.29856 0.795355 0.131353
C  0.092252 1.110984 0.128093
C  -1.726155 -0.578753 -0.03008
C  -0.668548 -1.563792 -0.20037
C  3.116467 2.497369 -0.980752
C  3.753487 -1.572812 1.077872
C  -2.312874 1.804138 0.285004
C  -3.118938 -0.892633 -0.019013
C  -3.668443 1.470731 0.287539
C  -4.083462 0.110096 0.136988
H  2.369161 2.118368 1.04321
H  3.982261 1.459235 0.730975
H  2.878128 -1.557888 -0.911286
H  4.255677 -0.431359 -0.723671
H  0.398712 2.154823 0.224044
H  3.77098 2.018389 -1.731366
H  2.131903 2.667719 -1.449991
H  3.553582 3.479358 -0.719128
H  4.211542 -0.879756 1.808028
H  2.85837 -2.024343 1.538448
H  4.482941 -2.377205 0.864725
H  -2.000492 2.848599 0.404625
H  -3.457566 -1.930582 -0.130328
H  -4.424699 2.255159 0.407771
H  -5.149309 -0.141461 0.144206
H  -0.184022 -3.548315 -0.498301
H  -1.916251 -3.2521 -0.430115
