program: Gaussian 09
title: 000211717
version: EM64L-G09RevD.01
frameworkgroup: C1[X(C12H13NOS2)]
method: RPBEPBE
basis: SDD
operation: Freq
keyword: #p
keyword: freq=noraman
keyword: PBEPBE/SDD
title: #p freq=noraman PBEPBE/SDD
converged: YES YES NO NO
title: Mulliken charges:
elementType: S S O N C C C C C C C C C C C C H H H H H H H H H H H H H
charge: 0.304158 0.152991 -0.181621 -0.195806 -0.583853 -0.320329 0.259489 0.492190 -0.600762 -0.679558 -0.334387 -0.325532 0.450771 -0.376420 -0.371340 -0.805389 0.301690 0.228900 0.245968 0.227225 0.213119 0.230344 0.244748 0.258520 0.234574 0.234694 0.239855 0.227761 0.228001
chargesum: 0.00000
title: Mulliken charges with hydrogens summed into heavy atoms:
elementType: S S O N C C C C C C C C C C C C
charge: 0.304158 0.152991 -0.181621 -0.195806 -0.282163 0.154539 0.259489 0.492190 -0.600762 -0.008870 -0.089640 -0.067012 0.450771 -0.141846 -0.136646 -0.109772
polarizability: 2.39375907e+02 9.07701458e+00 1.71200276e+02 4.06255310e+00 1.14878698e+01 1.17393446e+02
1716.lowfreq: -6.6655 0.0017 0.0028 0.0035 3.5956 7.9190 30.4083 34.3512 38.6687
frequency: 30.2460 34.2329 38.6233 53.8575 62.2823 98.5043 123.6568 156.3021 170.9129 215.5487 231.4351 277.4218 298.9901 318.8420 354.0840 356.3839 399.1284 408.7254 419.8025 484.7320 505.5681 519.1469 549.4308 591.5354 636.9077 674.5311 707.3290 728.4087 742.2804 803.1932 816.1305 823.6932 838.1407 892.1038 946.0989 965.4896 970.1513 989.8850 1005.1283 1019.9041 1046.0558 1048.5952 1079.4924 1096.8466 1122.9096 1159.7204 1191.2333 1191.5678 1222.0349 1222.3021 1239.1045 1280.2825 1300.9099 1308.4928 1337.1920 1376.1130 1396.4309 1398.8696 1407.8584 1459.2832 1471.8287 1474.5757 1476.1890 1483.6187 1504.2892 1592.7977 1620.0652 1635.6597 2977.7324 2980.6605 2995.1041 3033.4174 3052.6983 3059.7182 3080.2186 3085.6917 3088.7886 3131.2073 3133.3454 3163.6134 3168.0359
redmass: 1.1646 2.7562 4.4326 5.2870 7.9969 2.4758 6.2568 3.0897 4.6142 3.9002 1.4218 4.7169 5.5023 3.7621 4.4925 3.3816 9.7260 2.8669 5.2924 5.1523 6.6280 5.0208 7.5071 4.7863 6.6602 3.1039 4.1963 5.1077 4.0550 2.1166 1.7714 1.9140 1.2537 2.2512 1.5571 3.0287 1.3997 1.4248 5.6086 3.4263 1.5579 1.5707 1.9651 2.4327 1.2875 3.8915 1.2412 1.2969 4.7987 3.4889 1.3529 1.1587 5.2207 1.4172 1.4010 6.0369 1.2095 1.2203 3.1847 1.0719 1.0981 1.0552 1.0488 1.0474 2.7175 6.7273 6.7049 11.8583 1.0389 1.0363 1.0599 1.0863 1.0989 1.0948 1.1016 1.0990 1.0999 1.0894 1.0893 1.0957 1.0966
irintensity: 1.0650 0.7745 0.7256 1.1232 0.4595 0.5220 0.6158 2.3679 0.3260 2.8943 2.2064 2.5651 3.0583 2.2871 1.2239 1.7844 1.9749 0.0790 4.4359 9.6444 2.6083 20.6672 6.6520 12.6624 1.2353 1.1443 4.9026 10.4472 33.7183 6.6376 20.3592 25.2714 0.3016 10.3952 5.6576 3.7895 0.4221 0.3800 11.8484 41.3414 1.7687 18.8954 12.2441 10.7899 11.0538 61.2261 5.3265 11.7061 217.1660 247.6775 12.7309 14.5482 114.3220 16.1046 3.9387 2.8640 17.8709 12.9793 2.2064 7.7059 12.6003 13.0085 12.9683 14.2070 64.2391 1.5233 21.2652 179.2127 31.9816 26.5237 10.9133 1.3721 0.7699 20.1618 43.7338 35.9902 16.7361 12.7705 19.4995 9.0877 0.9972
temp: 298.150 k
press: 1.00000 atm
elementType: 16 16 8 7 6 6 6 6 6 6 6 6 6 6 6 6 1 1 1 1 1 1 1 1 1 1 1 1 1
symmnumber: 1
zpe: 582302.2 jmol-1
zpe.correction: 0.221787 hartree
zpe.thermalcorrener: 0.237987 hartree
zpe.thermalcorrenthalpy: 0.238931 hartree
zpe.thermalcorrgfe: 0.175643 hartree
zpe.sumelectzpe: -1390.031356 hartree
zpe.sumelectthermal: -1390.015156 hartree
zpe.sumelectthermalent: -1390.014211 hartree
zpe.sumelectthermalfe: -1390.077500 hartree
dipole: 0.1928 -2.0461 0.4328
dipole: 2.1003
quadrupole: -86.3043 -124.5363 -102.9070
quadrupole: 3.7946 0.4581 3.1893
quadrupole: 18.2782 -19.9537 1.6755 3.7946 0.4581 3.1893
hfenergy: -1390.2531428 hartree
pointgroup: C01 [X(C12H13N1O1S2)]
dipole: -0.0398241 0.7408593 0.3637568 debye
polarizability: 239.8351877|7.4531276|172.8034364|-4.7874875|2.5682664|115.3310044 unknown
InChI: InChI=1S/C12H13NOS2/c1-3-10-11(14)13(12(15)16-10)9-6-4-8(2)5-7-9/h4-7,10H,3H2,1-2H3
charge 0 multiplicity 1
29 atoms
S  2.896827 -1.327868 -0.84768
S  0.269207 -2.912985 -0.997273
O  1.006158 2.055216 0.045449
N  0.515443 -0.219769 -0.3835
C  2.864325 0.530479 -0.43826
C  3.723127 0.88832 0.795695
C  1.391211 0.896321 -0.236125
C  -0.916873 -0.043476 -0.202343
C  1.080994 -1.469057 -0.719852
C  5.228384 0.65317 0.563553
C  -1.624393 0.818931 -1.065597
C  -1.583288 -0.717203 0.843029
C  -3.705771 0.335926 0.162929
C  -3.010023 1.002998 -0.878049
C  -2.969654 -0.527528 1.015472
C  -5.192285 0.560296 0.374692
H  3.239465 1.066058 -1.329116
H  3.37201 0.301761 1.665298
H  3.5322 1.955031 1.022837
H  5.443963 -0.411382 0.356769
H  5.599699 1.250233 -0.290331
H  5.807957 0.945192 1.45694
H  -1.098519 1.340439 -1.87117
H  -1.026893 -1.388356 1.503995
H  -3.558277 1.672451 -1.55101
H  -3.486959 -1.058095 1.823301
H  -5.369405 1.413877 1.05766
H  -5.706889 0.788605 -0.575018
H  -5.676845 -0.324583 0.822804
