program: Gaussian 09
title: 000216986
version: EM64L-G09RevD.01
frameworkgroup: C1[X(C19H16N2)]
method: RPBEPBE
basis: SDD
operation: Freq
keyword: #pfreq=noraman
keyword: PBEPBE/SDD
title: #p freq=noraman PBEPBE/SDD
converged: YES YES NO NO
title: Mulliken charges:
elementType: N N C C C C C C C C C C C C C C C C C C C H H H H H H H H H H H H H H H H
charge: -0.232532 -0.274442 0.391231 0.307970 -0.535711 -0.403876 -0.246278 -0.181512 0.341583 0.463895 -0.382068 -0.370187 -0.359699 -0.387777 0.440440 -0.409400 -0.404522 -0.227789 -0.223901 -0.252419 -0.812297 0.242316 0.257027 0.265003 0.255415 0.225047 0.220397 0.246008 0.232586 0.224622 0.224485 0.228284 0.227411 0.231534 0.233279 0.223321 0.222556
chargesum: 0.00000
title: Mulliken charges with hydrogens summed into heavy atoms:
elementType: N N C C C C C C C C C C C C C C C C C C C
charge: -0.232532 -0.274442 0.391231 0.307970 -0.293394 -0.146849 0.018724 0.073902 0.341583 0.463895 -0.157021 -0.149790 -0.113691 -0.155191 0.440440 -0.184778 -0.180037 0.000495 0.003510 -0.020885 -0.133141
polarizability: 3.96321486e+02 3.47760462e+00 2.39358292e+02 -1.08860239e+01 -6.34639547e-01 9.81575790e+01
1716.lowfreq: -26.9476 -4.1596 -0.0005 -0.0003 0.0006 0.3558 8.6391 28.9182 37.1717
frequency: -26.8564 28.8744 37.1601 50.7568 65.7209 85.2065 120.6025 150.0829 211.0469 236.6442 248.6288 292.2915 323.6151 340.6523 359.0086 370.3951 406.1793 408.9765 437.1257 501.6752 508.7688 560.3487 579.0980 587.5750 614.5983 629.6534 639.3951 659.7295 662.3374 681.5070 694.2165 705.1654 719.7954 755.7835 759.8286 768.0497 792.8614 796.0075 804.1268 829.1180 832.9558 842.8957 897.1298 923.5905 951.5626 960.0696 965.3611 969.5259 983.0616 986.0047 987.1226 1009.9862 1024.9476 1045.1861 1046.3941 1077.1694 1081.2054 1110.4183 1121.6670 1173.4450 1189.9684 1192.4110 1196.7000 1201.3869 1217.6344 1227.6678 1279.3142 1304.6712 1315.3046 1327.7244 1341.3378 1376.1193 1383.3355 1393.7139 1404.2587 1416.4526 1423.8506 1448.4374 1471.3353 1472.3490 1487.9488 1497.2415 1548.6160 1551.3320 1571.7789 1591.9524 1596.6042 1616.8162 1627.5590 2970.4188 3050.7932 3080.1973 3113.2638 3115.4556 3130.8265 3138.8759 3139.1342 3145.9208 3154.3892 3167.4206 3181.7113 3240.6701 3245.2364 3252.9158 3280.0650
redmass: 1.0159 3.7925 3.7822 4.7065 4.3513 4.5336 4.5760 4.6029 4.5973 4.8926 5.6106 4.0084 3.9477 5.9004 4.5244 4.1428 2.8471 2.9038 4.2727 3.0631 2.8474 4.1689 3.7527 4.2408 6.1476 1.8304 4.4574 5.9544 1.9199 1.4625 1.9246 3.0274 2.4572 1.9150 1.7898 4.1213 2.5589 1.9512 4.9454 1.2579 1.6854 1.2634 1.4380 6.5118 1.3422 3.6954 1.4270 1.4116 1.4161 3.2682 1.5518 3.1162 2.1157 1.5979 2.0090 1.7372 1.5631 2.2847 1.3647 1.0802 2.0542 1.1387 1.1111 2.1354 1.7523 2.4868 1.9712 1.4907 3.5925 1.4065 2.7877 7.4207 6.7376 1.2307 4.4355 3.7613 4.1390 2.4812 1.1100 1.0550 3.0637 2.7770 4.6407 5.7056 6.0763 6.3564 8.2954 6.1437 6.3832 1.0386 1.0947 1.0996 1.0872 1.0875 1.0849 1.0953 1.0890 1.0962 1.0937 1.0982 1.0964 1.0964 1.0983 1.0912 1.1084
irintensity: 0.5509 0.1174 0.7300 0.6281 2.8170 0.5481 0.1514 0.9813 0.1261 1.3896 0.8476 0.7650 0.4562 0.6173 2.7682 1.8148 0.0058 1.8229 2.1674 5.1741 23.7952 4.5555 0.6819 11.7074 0.1912 8.9070 3.2231 10.1343 23.6001 32.7816 51.5305 46.8495 0.4668 101.0447 38.9653 28.8614 13.5583 7.2552 5.8268 0.0165 37.4989 0.4744 5.9811 0.2592 1.5464 2.9355 0.2676 0.4171 0.2423 1.7150 1.3083 1.4487 8.1970 23.1543 4.3219 13.3924 7.2240 4.9910 14.7623 2.0883 54.3894 0.9664 2.8087 59.8578 33.1911 6.4704 7.1619 2.7720 45.9682 2.3631 7.1333 7.1645 2.7313 3.8840 62.8404 3.2048 54.3632 21.4119 15.7989 12.5335 7.7836 208.6484 61.1383 178.7574 20.0632 6.9592 106.4612 164.7209 6.1344 60.3707 25.8946 19.1967 12.1582 38.0834 5.3661 41.0386 7.7286 1.8333 27.2665 26.3251 3.3007 2.3768 1.0698 10.3897 0.2336
temp: 298.150 k
press: 1.00000 atm
elementType: 7 7 6 6 6 6 6 6 6 6 6 6 6 6 6 6 6 6 6 6 6 1 1 1 1 1 1 1 1 1 1 1 1 1 1 1 1
symmnumber: 1
zpe: 774542.7 jmol-1
zpe.correction: 0.295008 hartree
zpe.thermalcorrener: 0.311334 hartree
zpe.thermalcorrenthalpy: 0.312278 hartree
zpe.thermalcorrgfe: 0.249672 hartree
zpe.sumelectzpe: -841.671966 hartree
zpe.sumelectthermal: -841.655639 hartree
zpe.sumelectthermalent: -841.654695 hartree
zpe.sumelectthermalfe: -841.717301 hartree
dipole: -1.9492 0.9283 0.0356
dipole: 2.1592
quadrupole: -101.7716 -103.3308 -131.4707
quadrupole: -2.2177 -2.4774 0.1293
quadrupole: 10.4195 8.8602 -19.2797 -2.2177 -2.4774 0.1293
hfenergy: -841.9669733 hartree
pointgroup: C01 [X(C19H16N2)]
dipole: -0.7597994 -0.3796584 -0.0148454 debye
polarizability: 396.1409841|-0.3167251|239.2199812|13.9660489|-3.0204395|98.4763909 unknown
InChI: InChI=1S/C19H16N2/c1-15-7-9-16(10-8-15)17-13-19-20(14-17)11-12-21(19)18-5-3-2-4-6-18/h2-14H,1H3
charge 0 multiplicity 1
37 atoms
N  -0.421533 -2.080127 0.045716
N  -2.362586 -0.918442 -0.003408
C  -0.958181 -0.773835 0.030728
C  1.318261 -0.637321 0.02528
C  0.096138 0.147691 0.009231
C  0.971861 -2.007871 0.048185
C  -1.468388 -3.021269 0.017921
C  -2.651324 -2.308925 -0.013882
C  2.690766 -0.094156 0.016844
C  -3.322021 0.131386 -0.010229
C  2.953365 1.239615 -0.402475
C  3.80371 -0.879507 0.429736
C  -2.969411 1.42606 0.453555
C  -4.641887 -0.106845 -0.47852
C  5.372558 0.971477 -0.007228
C  4.26367 1.760073 -0.4086
C  5.113046 -0.358946 0.413639
C  -3.927306 2.460973 0.448368
C  -5.591911 0.934204 -0.469784
C  -5.243709 2.225827 -0.009781
C  6.787414 1.522946 -0.047775
H  0.032299 1.231719 0.004348
H  1.592783 -2.89844 0.018016
H  -1.305745 -4.093586 0.037382
H  -3.669479 -2.681954 0.009984
H  2.124897 1.871184 -0.742561
H  3.637535 -1.900798 0.791901
H  -1.967043 1.612095 0.846946
H  -4.920971 -1.088335 -0.874567
H  4.43118 2.793591 -0.736961
H  5.947718 -0.990091 0.74383
H  -3.643186 3.453656 0.814711
H  -6.605118 0.737812 -0.837482
H  -5.983644 3.0327 -0.011034
H  7.262802 1.334478 -1.030645
H  6.801845 2.614943 0.117896
H  7.427794 1.053418 0.720113
