program: Gaussian 09
title: 000211711
version: EM64L-G09RevD.01
frameworkgroup: C1[X(C14H17NO3S2)]
method: RPBEPBE
basis: SDD
operation: Freq
keyword: #p
keyword: freq=noraman
keyword: PBEPBE/SDD
title: #p freq=noraman PBEPBE/SDD
converged: YES YES NO NO
title: Mulliken charges:
elementType: S S O O O N C C C C C C C C C C C C C C H H H H H H H H H H H H H H H H H
charge: 0.312064 0.119793 -0.206463 -0.306055 -0.300174 -0.035595 -0.412116 -0.557664 -0.562880 0.307410 0.547345 -0.553127 -0.627070 -0.541828 -0.407404 0.225882 -0.337949 0.175926 -0.530052 -0.530213 0.272682 0.265348 0.239274 0.232257 0.308472 0.252358 0.238747 0.238086 0.267138 0.243620 0.248908 0.230432 0.253008 0.222980 0.229625 0.254188 0.223050
chargesum: 0.00000
title: Mulliken charges with hydrogens summed into heavy atoms:
elementType: S S O O O N C C C C C C C C C C C C C C
charge: 0.312064 0.119793 -0.206463 -0.306055 -0.300174 -0.035595 0.125914 -0.086133 -0.254408 0.307410 0.547345 -0.553127 0.102120 -0.274690 -0.163784 0.225882 -0.089041 0.175926 0.176368 0.176649
polarizability: 2.81159567e+02 2.26481231e+01 2.25643952e+02 1.22330183e+01 -2.91672056e+00 1.13178208e+02
1716.lowfreq: -13.5223 -8.1113 -0.0016 -0.0014 -0.0003 5.6840 5.7584 21.1025 32.0333
frequency: -5.0689 21.0040 31.9559 43.1274 58.8330 66.0181 86.8307 102.5592 115.9448 119.5966 156.2620 161.5646 174.3177 216.6517 222.1064 241.3933 258.7440 279.1217 283.1219 306.1290 334.2977 341.8722 353.4890 399.6559 402.9289 431.3651 464.7960 491.0013 503.2056 517.6533 558.0742 573.8608 588.6511 650.1114 675.8412 706.5320 709.6821 737.5741 750.2850 776.3597 829.3500 840.2751 886.3702 902.2983 935.9623 945.8439 957.8109 976.5979 994.9132 1018.2214 1029.4893 1052.1477 1072.2547 1093.7091 1107.4379 1113.8655 1115.2354 1140.8527 1153.4438 1156.9827 1166.8003 1195.1035 1202.2261 1244.9533 1260.7003 1270.2191 1276.3644 1287.7266 1296.4473 1341.3176 1362.5925 1367.0940 1391.1814 1401.5049 1424.3548 1443.6688 1448.7009 1457.2566 1459.3611 1467.0878 1473.4667 1477.2006 1479.1734 1485.6775 1487.9462 1574.2318 1613.3868 1628.1338 2970.7031 2972.5186 2997.8231 3004.5536 3031.5681 3047.6979 3063.4281 3066.9251 3068.6587 3099.3224 3104.2567 3110.2030 3120.9799 3121.2507 3128.9313 3142.7308 3162.3326
redmass: 5.2368 6.5494 4.6741 4.2649 4.4965 6.8790 4.0630 3.7563 3.9808 3.9619 1.2426 1.1275 2.2197 4.0571 1.0616 4.3112 3.6135 5.7051 3.3427 4.3152 4.2157 4.4064 4.6738 15.3262 5.1997 4.4177 6.0947 3.6849 14.9690 6.7059 6.5778 4.7751 5.4936 4.5845 3.9487 5.1492 4.9334 4.1006 3.4097 1.4300 2.4551 1.6879 4.8143 1.5812 3.8362 6.6945 1.4325 3.5912 2.2271 1.9699 3.0497 2.1981 2.5669 2.8323 2.7967 1.2412 1.2422 1.4904 1.3307 1.5104 1.6041 1.8175 1.3591 2.0876 2.0490 2.1762 1.4115 3.2045 1.5144 1.5997 1.3961 6.0734 1.1831 2.2030 1.1782 1.3891 1.1089 1.0536 1.0696 1.0453 1.0495 1.0741 1.1147 2.6770 1.0570 7.2417 6.7049 10.8320 1.0308 1.0311 1.0349 1.0590 1.0581 1.0845 1.1034 1.1040 1.1041 1.1002 1.1068 1.1015 1.1026 1.1026 1.0892 1.0921 1.0956
irintensity: 0.1562 0.3355 1.0542 0.0433 0.9955 0.6172 6.6866 6.8389 3.1872 1.0693 1.1665 0.1124 7.2035 1.8030 0.3704 3.7001 10.0267 1.5318 5.6637 4.4329 6.9944 1.3725 2.0985 5.2411 7.2142 10.3496 21.8982 5.6418 2.4590 10.3074 7.6837 12.3239 1.2397 17.2633 1.5494 6.1699 5.9429 15.9700 1.1179 5.9284 10.3865 30.0351 12.7334 8.5265 49.9456 61.0210 3.0010 65.6964 27.4865 1.8251 3.7797 13.5489 10.6840 46.1061 40.1326 15.4456 1.7579 14.7642 0.9840 6.0781 164.1043 56.7679 38.4403 67.2935 161.3053 47.2825 15.3038 149.3940 9.3272 143.8174 21.4817 9.7212 17.1631 16.3137 0.9504 16.3709 31.6611 16.6402 6.5336 21.4287 9.3677 12.3848 11.7625 127.3391 30.6038 10.4807 6.8968 190.9304 88.2256 59.2782 18.6091 13.5761 17.5669 2.0731 4.3052 32.8553 21.7229 8.1171 0.7921 15.9773 21.7554 27.5552 9.2617 3.8263 6.6749
temp: 298.150 k
press: 1.00000 atm
elementType: 16 16 8 8 8 7 6 6 6 6 6 6 6 6 6 6 6 6 6 6 1 1 1 1 1 1 1 1 1 1 1 1 1 1 1 1 1
symmnumber: 1
zpe: 750258.0 jmol-1
zpe.correction: 0.285758 hartree
zpe.thermalcorrener: 0.306101 hartree
zpe.thermalcorrenthalpy: 0.307045 hartree
zpe.thermalcorrgfe: 0.234758 hartree
zpe.sumelectzpe: -1618.727260 hartree
zpe.sumelectthermal: -1618.706917 hartree
zpe.sumelectthermalent: -1618.705973 hartree
zpe.sumelectthermalfe: -1618.778260 hartree
dipole: -0.3402 -1.5525 0.1981
dipole: 1.6016
quadrupole: -106.8294 -143.1436 -132.1505
quadrupole: 12.0017 -0.4184 5.9816
quadrupole: 20.5451 -15.7691 -4.7760 12.0017 -0.4184 5.9816
hfenergy: -1619.0130179 hartree
pointgroup: C01 [X(C14H17N1O3S2)]
dipole: -0.152191 -0.5996256 0.1197754 debye
polarizability: 281.9767423|22.1188469|223.391786|13.1622874|-10.9874466|114.6131987 unknown
InChI: InChI=1S/C14H17NO3S2/c1-9-13(16)15(14(19)20-9)7-6-10-4-5-11(17-2)12(8-10)18-3/h4-5,8-9H,6-7H2,1-3H3
charge 0 multiplicity 1
37 atoms
S  -5.148054 1.259345 -0.588954
S  -2.531771 2.875647 -0.310296
O  -3.286405 -2.129043 0.363565
O  3.949973 1.721773 -0.200483
O  5.027825 -0.895083 0.562159
N  -2.822303 0.1627 0.095742
C  -1.382012 -0.013664 0.405876
C  -0.545708 -0.297783 -0.871649
C  -5.127262 -0.616931 -0.257399
C  -3.676539 -0.965687 0.092456
C  0.927061 -0.448094 -0.521596
C  -3.363003 1.413389 -0.236928
C  -6.104302 -1.036485 0.856674
C  1.786126 0.67846 -0.524062
C  1.454181 -1.704368 -0.12569
C  3.142649 0.560052 -0.156556
C  2.815779 -1.836325 0.221718
C  3.673278 -0.715774 0.193214
C  4.511245 2.132859 1.108094
C  6.004933 -0.596659 -0.51202
H  -1.029878 0.910713 0.893239
H  -1.304143 -0.861067 1.108075
H  -0.692598 0.537521 -1.579797
H  -0.927346 -1.221502 -1.343929
H  -5.383313 -1.116054 -1.208046
H  -5.998231 -2.120666 1.039815
H  -5.892522 -0.497226 1.795261
H  -7.146495 -0.829043 0.561376
H  1.414455 1.670363 -0.805461
H  0.801563 -2.585359 -0.108954
H  3.241898 -2.803907 0.50586
H  5.134811 3.014286 0.89463
H  5.119432 1.323667 1.551076
H  3.69366 2.409243 1.800678
H  6.995373 -0.745207 -0.055517
H  5.893827 0.442013 -0.871882
H  5.868516 -1.301205 -1.354286
