program: Gaussian 09
title: 000211706
version: EM64L-G09RevD.01
frameworkgroup: C1[X(C11H8ClNOS2)]
method: RPBEPBE
basis: SDD
operation: Freq
keyword: #p
keyword: freq=noraman
keyword: PBEPBE/SDD
title: #p freq=noraman PBEPBE/SDD
converged: NO NO NO NO
title: Mulliken charges:
elementType: Cl S S O N C C C C C C C C C C C H H H H H H H H
charge: -0.045794 0.287718 0.133553 -0.216419 -0.086345 -0.154510 0.309261 0.297842 -0.303541 -0.501635 -0.607259 -0.350901 -0.350889 -0.195513 -0.195515 -0.108699 0.277559 0.261276 0.266629 0.261281 0.250972 0.250975 0.259977 0.259977
chargesum: 0.00000
title: Mulliken charges with hydrogens summed into heavy atoms:
elementType: Cl S S O N C C C C C C C C C C C
charge: -0.045794 0.287718 0.133553 -0.216419 -0.086345 -0.154510 0.309261 0.297842 -0.025982 -0.501635 0.181926 -0.099929 -0.099913 0.064464 0.064462 -0.108699
polarizability: 2.85150004e+02 -1.39472936e+01 1.62716488e+02 1.14126749e-02 -6.00891595e-03 1.08603530e+02
1716.lowfreq: -60.9029 -0.0027 -0.0022 0.0005 4.8114 5.9108 13.5815 32.1864 43.8858
frequency: -60.8618 32.1864 43.8606 76.5430 108.5610 109.4727 138.1236 184.6607 229.4620 239.2809 259.2593 283.0265 325.8353 355.6916 395.1873 396.2764 398.1288 459.7076 461.4214 484.8464 518.6923 532.5203 605.6139 623.6154 629.7690 703.6037 709.7469 722.1920 803.7107 831.1089 831.1632 864.8302 916.8956 949.4661 960.7410 967.4757 999.7406 1073.4912 1095.4052 1106.3392 1122.3137 1127.6509 1185.7958 1222.0889 1273.2384 1279.0063 1291.0679 1322.4739 1346.3111 1387.4362 1437.2854 1467.5536 1472.4664 1476.6169 1571.7618 1594.8273 1625.8125 1644.7841 3008.5782 3089.6460 3105.5392 3129.4547 3147.2490 3147.9426 3172.1736 3175.5595
redmass: 4.1593 15.2980 7.1177 9.0719 5.8122 9.9145 1.0446 10.3830 5.5720 8.0687 6.0938 6.5325 4.4550 7.0342 10.3240 2.8905 17.1146 6.0916 2.7343 4.1968 17.7299 9.8710 5.3348 6.4865 5.8792 4.7495 6.4275 4.6179 2.8728 2.0364 1.2575 1.6925 4.8416 1.8703 2.5003 1.3659 4.1375 2.7781 6.8334 1.3747 2.3783 1.3160 1.1258 2.3906 3.6123 1.7427 1.2538 5.9670 5.1894 3.6552 1.2634 1.0421 2.4000 1.0679 7.6032 6.3641 11.4838 9.7796 1.0322 1.0877 1.1022 1.1026 1.0894 1.0893 1.0961 1.0973
irintensity: 0.2990 0.0511 0.1328 0.1295 7.3790 0.1781 0.0992 0.5404 0.4914 2.5333 0.1280 2.6498 4.1827 1.1885 32.1610 0.3431 3.5304 10.4073 2.8112 26.7951 1.4826 3.5502 40.5840 0.3637 11.3191 9.1546 19.1994 2.2650 22.2379 69.0955 0.0450 11.2109 12.3001 14.7831 18.9144 0.1055 65.5180 53.2113 2.7043 9.9935 257.7942 0.3851 3.2348 1.9752 277.2035 97.4543 0.0544 89.5809 0.1774 4.9844 83.0393 20.8283 93.9524 42.2848 0.7422 4.9058 218.8453 36.3449 17.2690 7.3295 10.6305 0.2950 3.5780 3.8360 5.2132 0.4989
temp: 298.150 k
press: 1.00000 atm
elementType: 17 16 16 8 7 6 6 6 6 6 6 6 6 6 6 6 1 1 1 1 1 1 1 1
symmnumber: 1
zpe: 426183.3 jmol-1
zpe.correction: 0.162325 hartree
zpe.thermalcorrener: 0.176638 hartree
zpe.thermalcorrenthalpy: 0.177582 hartree
zpe.thermalcorrgfe: 0.119217 hartree
zpe.sumelectzpe: -1809.004089 hartree
zpe.sumelectthermal: -1808.989775 hartree
zpe.sumelectthermalent: -1808.988831 hartree
zpe.sumelectthermalfe: -1809.047197 hartree
dipole: 0.2469 1.6920 -0.0001
dipole: 1.7100
quadrupole: -117.1764 -127.6009 -106.3222
quadrupole: 2.4004 0.0022 -0.0054
quadrupole: -0.1433 -10.5677 10.7110 2.4004 0.0022 -0.0054
hfenergy: -1809.1664132 hartree
pointgroup: C01 [X(C11H8Cl1N1O1S2)]
dipole: 0.1157874 -0.6627097 -0.0001963 debye
dipolederiv: -0.8774258 0.2036654 -0.000122 0.3083736 -0.1394386 0.0000984 -0.0000853 0.0000701 -0.121566 -0.6173397 -0.1454311 -0.0002031 -0.3130052 -0.2256993 -0.0002347 -0.0002708 -0.0002145 0.1059246 -0.6602998 -0.3692368 -0.0002746 -0.4588983 -0.6127851 -0.0003419 -0.0002814 -0.0002599 -0.1084866 -0.6168956 0.1892811 0.0000181 0.1791036 -1.1614113 -0.0002598 0.0000168 -0.0006488 -0.3166156 -0.9271273 -0.3340432 -0.0003032 -0.1435521 -1.5297429 -0.0008035 -0.0003249 -0.000715 -0.0705938 -0.8745085 0.2099521 -0.0000558 0.4704453 0.5063329 0.0004533 0.0000197 0.00037 -0.0955234 1.339631 0.3530235 0.0004295 0.0443272 1.4454227 0.0005115 0.0003687 0.0008588 0.2541528 0.2005253 0.0390827 0.0000728 -0.1593603 -0.0978628 -0.0000789 0.0000132 -0.0000362 -0.030971 0.434889 -0.0781265 0.0001411 -0.2159335 -0.1225604 -0.0000475 -0.0000153 -0.0000083 -0.1359217 1.4797615 0.3205575 0.0004158 0.505189 1.4255751 0.0008518 0.0004919 0.0008209 -0.1708743 0.3801739 -0.0816983 -0.0001142 -0.079645 0.0802828 -0.0000146 -0.0001048 -0.0000486 0.184464 -0.0929559 -0.088272 0.0510196 0.0034551 -0.0796912 -0.0113933 -0.1659738 -0.0250208 0.0836674 -0.0931505 -0.0882367 -0.0512447 0.0030029 -0.0797338 0.0111271 0.1658316 0.0247085 0.0837398 -0.3494077 0.0415842 -0.0746148 0.0905858 -0.1106813 0.0326847 -0.0389765 0.0438353 -0.0025861 -0.3494211 0.0415316 0.0744319 0.0905952 -0.1105579 -0.0327771 0.0387995 -0.0439672 -0.0025909 1.2482061 -0.3820593 0.0001387 -0.4906052 0.0788545 -0.0002163 0.0001439 -0.0001801 0.1156853 -0.0251279 0.0310445 -0.0000344 0.0625495 0.0336327 -0.0000398 -0.000094 -0.0000319 0.1619254 0.0142434 0.0145488 0.0260054 -0.0671394 0.0813473 0.084365 0.0568295 0.0356279 -0.0229995 0.1495011 -0.0493511 0.0000557 0.0841581 -0.0109797 0.0001308 0.0001136 0.0000304 0.1342637 0.0144264 0.0144922 -0.0259747 -0.0673989 0.0813325 -0.0845057 -0.0567178 -0.0356798 -0.0227461 0.075602 0.0551253 -0.0775512 0.0347934 0.12277 0.0229868 -0.0857368 0.0127449 -0.0158955 0.0754598 0.0550174 0.0776861 0.0346792 0.1228144 -0.0227445 0.0858653 -0.0124924 -0.0158221 0.0355688 0.0237387 0.0603589 0.0421 0.1514218 -0.0237822 0.056274 -0.0178651 0.0046998 0.0356714 0.0238101 -0.0602809 0.04218 0.1513575 0.0240306 -0.0561862 0.0181019 0.0046699 unknown
polarizability: 284.2706439|17.3613258|163.5958347|0.0420852|0.0199109|108.6035436 unknown
InChI: InChI=1S/C11H8ClNOS2/c1-13-10(14)9(16-11(13)15)6-7-2-4-8(12)5-3-7/h2-6H,1H3
charge 0 multiplicity 1
24 atoms
Cl -5.800439 0.986705 -0.000664
S  1.155358 1.380774 0.001793
S  3.978497 2.67813 0.002763
O  2.703162 -2.272886 0.000017
N  3.424443 -0.017994 0.001486
C  1.065895 -0.443476 0.000776
C  2.432044 -1.045162 0.000914
C  -1.459507 -0.653286 -0.000095
C  -0.069286 -1.194675 0.000059
C  3.000234 1.310565 0.00207
C  4.855584 -0.369535 0.001383
C  -2.134592 -0.400063 1.223114
C  -2.13358 -0.398225 -1.223481
C  -3.45552 0.100019 1.229429
C  -3.454507 0.101854 -1.230138
C  -4.097091 0.343448 -0.000439
H  0.075368 -2.285983 -0.000442
H  5.346174 0.046552 -0.89386
H  4.920874 -1.468732 0.001871
H  5.346449 0.047503 0.896016
H  -1.628211 -0.590338 2.175236
H  -1.626414 -0.587075 -2.17547
H  -3.972161 0.297821 2.173078
H  -3.970373 0.301057 -2.173916
