program: Gaussian 09
title: 000216983
version: EM64L-G09RevD.01
frameworkgroup: C1[X(C12H19OPS2)]
method: RPBEPBE
basis: SDD
operation: Freq
keyword: #p
keyword: freq=noraman
keyword: PBEPBE/SDD
title: #p freq=noraman PBEPBE/SDD
converged: YES YES NO NO
title: Mulliken charges:
elementType: S S P O C C C C C C C C C C C C H H H H H H H H H H H H H H H H H H H
charge: -0.023999 -0.216186 0.416308 -0.454049 -0.843901 -0.350814 -0.242620 -0.348914 0.519598 -0.682169 -0.355410 -0.367747 -0.221824 -0.224866 -0.234727 -0.818304 0.273875 0.305162 0.215550 0.208552 0.190075 0.226212 0.192263 0.196894 0.212648 0.214017 0.217466 0.243493 0.237008 0.229058 0.227736 0.230158 0.267913 0.269237 0.292306
chargesum: 0.00000
title: Mulliken charges with hydrogens summed into heavy atoms:
elementType: S S P O C C C C C C C C C C C C
charge: -0.023999 -0.216186 0.416308 -0.454049 -0.264863 0.073288 0.173666 0.040244 0.519598 -0.038038 -0.111917 -0.130739 0.007233 0.002870 -0.004569 0.011151
polarizability: 2.47959636e+02 2.63384916e+00 1.60385382e+02 6.99448707e+00 -3.11622890e+00 1.91528066e+02
1716.lowfreq: -10.0480 -2.3779 -0.0025 -0.0024 0.0017 3.8621 12.8310 14.4561 21.2002
frequency: 10.6871 13.5529 21.0739 29.8557 39.2188 63.1949 65.3136 98.1484 109.1680 122.6218 128.3992 148.7882 151.2873 175.2657 200.9852 213.5752 240.8936 284.6752 293.1030 332.0353 334.4293 373.8327 401.8998 426.1960 467.3821 550.1632 565.6884 616.7047 647.7597 660.8241 678.9592 698.6457 741.6655 776.5213 805.2679 809.8950 847.0730 870.6066 899.1961 921.7863 930.1709 935.0734 973.5811 974.8271 989.7778 994.8222 996.8234 1027.3422 1036.0155 1077.4984 1079.4408 1115.5834 1139.8506 1146.8406 1174.2496 1190.8692 1209.5717 1217.8387 1239.4119 1268.4585 1275.1453 1282.7249 1328.8026 1340.4953 1351.0329 1364.4378 1386.1560 1391.5673 1418.4495 1441.6116 1449.8821 1454.1058 1468.0444 1473.5267 1478.8855 1482.3536 1483.8488 1490.2972 1593.3109 1612.9193 2948.6223 2964.5629 2967.8068 2976.8051 2997.3069 3011.8643 3015.7462 3019.4630 3063.3536 3076.3213 3076.9475 3088.6218 3097.5223 3125.0720 3130.2188 3140.8284 3150.1320 3151.7726 3166.8132
redmass: 2.3670 3.3790 3.8112 2.9593 3.5949 4.7441 5.1537 2.7088 2.2108 1.5915 2.1970 6.4301 4.6770 6.0624 6.4522 4.6593 1.1133 5.9192 5.5684 2.6237 4.1045 6.7853 2.8002 3.2965 4.2872 7.3433 5.3268 6.3515 7.9010 9.0816 6.1076 1.7298 1.0729 2.0287 1.1532 4.1477 1.2615 1.6897 1.8518 1.4333 2.8313 1.5619 1.1922 1.3600 5.6121 1.1998 1.3511 2.2061 3.6001 1.6922 2.0543 2.4720 1.4133 1.0833 1.0510 1.1155 1.3905 2.3690 1.3590 1.2824 1.1609 1.0798 1.2675 1.4270 1.1214 1.3914 8.4344 1.2118 1.1188 2.1898 1.0509 1.0542 1.0735 1.0688 1.0422 1.0687 2.3032 1.0884 6.0550 6.1007 1.0580 1.0398 1.0587 1.0362 1.0602 1.0996 1.0595 1.1011 1.1042 1.1006 1.1008 1.1046 1.0895 1.0849 1.0879 1.0925 1.1070 1.0968 1.1018
irintensity: 0.1440 0.3125 0.8539 1.1653 0.0220 0.6427 1.4417 0.2802 0.9809 0.6047 0.8564 0.8730 4.2576 1.1335 15.5105 0.6766 0.1422 2.9802 2.2279 7.0051 19.0219 25.1205 0.1066 1.4814 34.4644 49.8462 3.5497 0.2798 5.5350 89.4288 33.9414 47.5814 8.6120 58.6618 0.4965 8.3010 2.8679 13.3116 27.5614 4.6555 126.3851 66.2404 7.2881 1.0352 0.2143 11.9482 0.0665 6.2325 21.1910 15.9762 2.8169 13.3496 3.4909 1.0240 0.0041 1.2782 0.7036 1.7976 1.0717 1.8459 3.3156 0.2142 0.7219 0.0043 6.4649 14.2841 0.3768 7.0716 12.6213 9.5199 10.7728 10.2099 1.9926 0.4283 12.6853 13.2622 13.9305 17.3925 1.1280 1.1517 32.7411 35.8679 35.7427 38.6610 32.6767 13.2039 9.3576 5.2394 8.7591 70.8172 76.8510 0.9543 4.3777 2.6609 0.1850 20.4278 10.5868 29.3699 19.7624
temp: 298.150 k
press: 1.00000 atm
elementType: 16 16 15 8 6 6 6 6 6 6 6 6 6 6 6 6 1 1 1 1 1 1 1 1 1 1 1 1 1 1 1 1 1 1 1
symmnumber: 1
zpe: 743429.8 jmol-1
zpe.correction: 0.283157 hartree
zpe.thermalcorrener: 0.303483 hartree
zpe.thermalcorrenthalpy: 0.304428 hartree
zpe.thermalcorrgfe: 0.228325 hartree
zpe.sumelectzpe: -1680.017255 hartree
zpe.sumelectthermal: -1679.996929 hartree
zpe.sumelectthermalent: -1679.995985 hartree
zpe.sumelectthermalfe: -1680.072087 hartree
dipole: -0.5889 -1.6526 -2.8676
dipole: 3.3617
quadrupole: -106.5813 -116.7777 -124.1857
quadrupole: 0.9384 1.8732 -5.4530
quadrupole: 9.2669 -0.9295 -8.3375 0.9384 1.8732 -5.4530
hfenergy: -1680.3004123 hartree
pointgroup: C01 [X(C12H19O1P1S2)]
dipole: 0.1787004 -0.6626302 1.1306145 debye
polarizability: 247.0566472|-8.8730889|161.22535|7.5021355|2.6288084|191.5910866 unknown
InChI: InChI=1S/C11H16OPS.CH3S/c1-2-3-9-12-13(14)10-11-7-5-4-6-8-11;1-2/h4-8H,2-3,9-10H2,1H3;1H3
charge 0 multiplicity 1
35 atoms
S  0.463883 1.741372 1.485311
S  -0.285156 1.798685 -2.165324
P  0.374879 0.65616 -0.577387
O  1.993044 0.03891 -0.895956
C  -0.600534 -0.932585 -0.16371
C  4.244137 -0.667577 -0.379292
C  2.855721 -0.42996 0.220206
C  5.251326 -1.182188 0.677021
C  -2.083447 -0.726865 0.023742
C  6.650666 -1.433278 0.074538
C  -2.955034 -0.74123 -1.096355
C  -2.627709 -0.517556 1.317373
C  -4.344582 -0.560571 -0.924656
C  -4.017664 -0.337616 1.489427
C  -4.880416 -0.360563 0.368922
C  0.328861 3.524999 0.888782
H  -0.119334 -1.338777 0.743321
H  -0.372743 -1.599796 -1.013842
H  4.607095 0.279169 -0.821898
H  4.158415 -1.397781 -1.206601
H  2.444173 -1.369847 0.646088
H  2.878983 0.343598 1.013205
H  4.869804 -2.121135 1.127726
H  5.330486 -0.446708 1.503154
H  6.606075 -2.192861 -0.72817
H  7.065137 -0.506196 -0.363595
H  7.360539 -1.792243 0.841852
H  -2.542277 -0.883629 -2.101591
H  -1.96157 -0.487505 2.187449
H  -5.007058 -0.574128 -1.797042
H  -4.426335 -0.179669 2.493661
H  -5.959182 -0.222243 0.502412
H  1.304216 4.020896 0.990425
H  -0.43768 4.017222 1.505062
H  0.00868 3.518894 -0.171558
