program: Gaussian 09
title: 000211699
version: EM64L-G09RevD.01
frameworkgroup: C1[X(C13H14BrNOS2)]
method: RPBEPBE
basis: SDD
operation: Freq
keyword: #p
keyword: freq=noraman
keyword: PBEPBE/SDD
title: #p freq=noraman PBEPBE/SDD
converged: YES YES NO NO
title: Mulliken charges:
elementType: Br S S O N C C C C C C C C C C C C C H H H H H H H H H H H H H H
charge: 0.013282 0.314438 0.157391 -0.178962 -0.197673 -0.619882 -0.312472 0.255877 -0.339951 0.518436 -0.607158 -0.691535 -0.513473 -0.357201 0.572036 -0.159042 -0.395026 -0.816500 0.304132 0.224473 0.241675 0.198002 0.212012 0.214251 0.216090 0.223768 0.271747 0.256552 0.253982 0.256134 0.231277 0.253323
chargesum: 0.00000
title: Mulliken charges with hydrogens summed into heavy atoms:
elementType: Br S S O N C C C C C C C C C C C C C
charge: 0.013282 0.314438 0.157391 -0.178962 -0.197673 -0.315750 0.153675 0.255877 0.070063 0.518436 -0.607158 -0.037426 -0.241726 -0.100648 0.572036 0.094939 -0.395026 -0.075766
polarizability: 2.98153787e+02 8.26074096e+00 1.82733199e+02 6.89184273e+00 1.63566974e+01 1.42122611e+02
1716.lowfreq: -6.8761 -2.9739 -0.0019 -0.0006 0.0010 2.6574 20.9663 26.8274 38.6027
frequency: 20.9544 26.7897 38.5656 53.5936 77.8860 90.8172 105.7042 126.4191 135.0660 140.4910 163.9529 201.5194 217.6588 237.4270 251.0010 273.0259 292.4503 295.9713 345.8886 382.5352 394.5616 413.1837 443.1012 461.3290 497.3547 533.0530 541.0612 544.1233 592.0194 659.8356 677.8452 703.9112 718.9689 741.3041 756.0736 815.6442 868.8498 881.8636 894.8379 906.3526 948.4448 961.8445 998.0464 1009.6906 1016.7807 1035.4456 1047.9491 1064.7183 1085.4794 1108.9443 1140.6814 1151.5240 1190.3866 1210.6455 1221.4037 1223.7524 1260.7757 1265.8178 1289.8429 1308.8893 1310.7174 1352.0764 1370.1016 1393.9732 1400.0547 1404.3276 1453.3147 1454.0280 1463.0763 1472.3239 1478.9577 1479.2762 1485.5388 1581.3681 1606.9727 1636.2127 2968.9835 2978.8566 2985.6309 2985.9459 3014.6614 3034.1813 3054.9844 3065.0252 3075.8516 3081.0461 3098.0375 3157.9383 3162.6013 3181.6549
redmass: 4.4687 5.6008 6.8837 8.0630 5.0317 1.7781 7.1516 5.2046 3.2051 1.1397 8.7356 4.8034 3.3530 1.4354 2.4987 8.0977 3.7430 5.2388 6.4012 7.1258 9.5528 4.4218 2.8908 4.3923 14.9950 5.9177 4.6904 7.0326 5.3187 6.6194 2.9625 4.9780 4.3279 2.9964 1.5392 1.4245 2.4995 1.3438 1.7178 1.9701 1.5983 3.0886 2.1996 4.3735 4.7022 2.4929 1.5380 1.7787 2.0705 2.0384 1.4466 2.3816 1.4272 3.7981 1.9901 2.1469 1.2670 1.4799 1.1196 1.4145 3.2471 1.5278 7.6621 1.2088 2.7832 1.3346 1.0819 2.1926 1.0454 1.0651 1.0416 1.2852 1.0716 6.7385 7.1292 12.5579 1.0593 1.0364 1.0589 1.0373 1.0998 1.0869 1.1011 1.0973 1.1010 1.0994 1.0995 1.0926 1.0889 1.0980
irintensity: 0.4921 0.0255 0.4427 0.3274 0.1275 0.0490 1.3429 2.6051 2.4465 0.0659 0.5604 0.7803 2.9388 0.4961 1.9394 1.9372 3.5126 3.7304 2.2268 16.7561 1.1271 7.5933 5.6879 3.9512 1.8245 4.3025 1.9608 5.8293 17.1341 3.3269 1.2337 1.0339 15.0660 32.0169 23.2109 16.4454 10.6474 2.0578 16.2938 1.0686 3.8109 16.9341 28.1010 54.1516 70.0580 10.1184 6.0970 2.5430 3.9365 27.6264 1.9401 24.6644 2.3817 286.1695 83.1349 157.0889 30.0750 21.9665 3.0895 20.3177 84.6999 0.4547 8.0302 11.9204 11.8422 23.8001 2.0010 54.6470 12.4061 4.2425 14.4586 76.0483 15.6815 4.3068 9.5132 183.4255 20.1980 31.5368 22.3931 17.7016 7.1142 1.2600 11.2224 9.7339 63.3699 42.8238 16.4998 3.1377 2.2276 2.0995
temp: 298.150 k
press: 1.00000 atm
elementType: 35 16 16 8 7 6 6 6 6 6 6 6 6 6 6 6 6 6 1 1 1 1 1 1 1 1 1 1 1 1 1 1
symmnumber: 1
zpe: 629545.4 jmol-1
zpe.correction: 0.239781 hartree
zpe.thermalcorrener: 0.258717 hartree
zpe.thermalcorrenthalpy: 0.259661 hartree
zpe.thermalcorrgfe: 0.189362 hartree
zpe.sumelectzpe: -1442.043577 hartree
zpe.sumelectthermal: -1442.024642 hartree
zpe.sumelectthermalent: -1442.023697 hartree
zpe.sumelectthermalfe: -1442.093997 hartree
dipole: -2.4093 -1.4881 0.7382
dipole: 2.9265
quadrupole: -118.4131 -146.2262 -121.6292
quadrupole: 7.8145 1.8675 2.9592
quadrupole: 10.3431 -17.4701 7.1270 7.8145 1.8675 2.9592
hfenergy: -1442.2833586 hartree
pointgroup: C01 [X(C13H14Br1N1O1S2)]
dipole: 1.002733 -0.3472831 -0.4467082 debye
polarizability: 298.5153062|-0.6807227|187.4253377|10.1961602|2.8375827|137.0689529 unknown
InChI: InChI=1S/C13H14BrNOS2/c1-3-4-11-12(16)15(13(17)18-11)9-5-6-10(14)8(2)7-9/h5-7,11H,3-4H2,1-2H3
charge 0 multiplicity 1
32 atoms
Br -5.647546 -0.981093 -0.247477
S  2.65711 1.436991 1.2905
S  -0.077236 2.824155 1.476025
O  1.026973 -2.009306 0.160009
N  0.371129 0.19856 0.701576
C  2.766927 -0.383712 0.746714
C  3.65155 -0.579831 -0.504523
C  1.327327 -0.843945 0.508069
C  5.141386 -0.267072 -0.246899
C  -1.03982 -0.065909 0.480227
C  0.84045 1.461043 1.127736
C  6.006987 -0.496747 -1.503695
C  -1.735016 0.645568 -0.518992
C  -1.690734 -1.047407 1.254372
C  -3.109529 0.408803 -0.76997
C  -3.056625 -1.307981 1.021083
C  -3.741628 -0.582236 0.026216
C  -3.838343 1.191402 -1.841152
H  3.181633 -0.95366 1.59788
H  3.267244 0.052702 -1.327859
H  3.539118 -1.635648 -0.821971
H  5.510758 -0.904503 0.582194
H  5.248044 0.784116 0.088591
H  5.938994 -1.545475 -1.848503
H  5.680022 0.15363 -2.336165
H  7.070317 -0.276101 -1.301199
H  -1.210466 1.402663 -1.109647
H  -1.146385 -1.605792 2.020615
H  -3.579877 -2.065873 1.609963
H  -4.684972 1.759016 -1.413127
H  -3.161013 1.905113 -2.338039
H  -4.262778 0.51993 -2.610054
