program: Gaussian 09
title: 000211692
version: EM64L-G09RevD.01
frameworkgroup: C1[X(C10H7ClINOS2)]
method: RPBEPBE
basis: SDD
operation: Freq
keyword: #p
keyword: freq=noraman
keyword: PBEPBE/SDD
title: #p freq=noraman PBEPBE/SDD
converged: YES YES NO NO
title: Mulliken charges:
elementType: I Cl S S O N C C C C C C C C C C H H H H H H H
charge: 0.168972 -0.007129 0.323069 0.172533 -0.180605 -0.204664 -0.560444 0.277753 0.520294 -0.605160 -0.624670 -0.301781 -0.345153 -0.004530 -0.124293 -0.363601 0.311175 0.240112 0.254936 0.238589 0.296267 0.260563 0.257769
chargesum: 0.00000
title: Mulliken charges with hydrogens summed into heavy atoms:
elementType: I Cl S S O N C C C C C C C C C C
charge: 0.168972 -0.007129 0.323069 0.172533 -0.180605 -0.204664 -0.249269 0.277753 0.520294 -0.605160 0.108967 -0.005514 -0.084590 -0.004530 0.133475 -0.363601
polarizability: 2.79209986e+02 1.36363589e+01 1.73644374e+02 -3.28242989e+00 9.18275250e-01 1.12601515e+02
1716.lowfreq: -7.0483 -0.0014 0.0004 0.0008 2.3372 6.5800 23.9851 34.4556 47.1323
frequency: 23.9371 34.3524 47.1238 60.7910 96.0451 115.3087 139.4344 146.8702 195.2423 222.6392 236.8104 251.8991 271.4044 317.9912 337.0172 367.5622 400.6338 421.3633 440.4889 447.6546 493.2889 502.5776 540.5977 582.8742 645.2709 681.7822 686.2977 700.9057 719.0518 804.2558 823.1690 878.4646 904.1186 954.5492 988.9478 1004.7039 1007.3374 1062.5834 1072.4732 1098.3547 1142.8894 1169.2464 1198.8651 1220.1046 1246.7100 1275.4057 1303.2436 1359.5246 1380.7441 1393.5583 1449.2819 1466.6764 1473.1946 1567.2669 1588.0774 1640.2718 2999.3127 3048.1765 3101.7603 3111.0005 3164.8754 3182.3288 3185.2402
redmass: 10.9836 7.1462 7.1875 7.6417 10.3130 7.9516 20.5197 17.7754 6.8191 1.0821 4.4890 7.3923 7.3552 4.4034 7.1400 11.3923 15.0164 10.2662 3.1621 6.6344 7.2995 9.7770 9.1079 6.1051 7.2625 5.9166 5.5640 3.5102 5.0606 2.4303 2.0376 1.6723 3.1768 1.3857 5.7399 1.8633 4.3476 2.4488 2.0944 2.2130 1.5193 3.0967 1.5186 4.6630 1.4068 1.3472 5.1331 6.3483 3.6202 1.1814 2.7851 1.0459 1.0483 8.5408 6.5940 12.0659 1.0349 1.0845 1.1004 1.1015 1.0889 1.0943 1.0968
irintensity: 0.3790 0.7388 1.7769 0.2737 1.2031 0.8253 0.8203 0.1662 1.6018 0.3098 0.4603 3.1383 2.8385 3.1969 5.8431 8.3306 3.6174 17.2221 6.1590 6.7856 3.3603 7.6303 3.8998 14.0581 2.9135 9.8795 10.4604 3.5961 24.1895 28.1983 33.5172 21.9836 6.8595 2.2649 42.9926 10.6720 44.2626 28.7284 25.5511 29.4941 0.1808 58.0943 32.8293 456.1719 7.7795 3.3817 129.5138 3.0872 21.4349 16.9467 142.2757 19.1853 8.9032 23.1373 11.3807 188.9125 17.1772 2.1227 7.4352 15.4437 1.5244 0.1324 2.8102
temp: 298.150 k
press: 1.00000 atm
elementType: 53 17 16 16 8 7 6 6 6 6 6 6 6 6 6 6 1 1 1 1 1 1 1
symmnumber: 1
zpe: 385161.2 jmol-1
zpe.correction: 0.146700 hartree
zpe.thermalcorrener: 0.162564 hartree
zpe.thermalcorrenthalpy: 0.163508 hartree
zpe.thermalcorrgfe: 0.099714 hartree
zpe.sumelectzpe: -1781.796119 hartree
zpe.sumelectthermal: -1781.780255 hartree
zpe.sumelectthermalent: -1781.779311 hartree
zpe.sumelectthermalfe: -1781.843105 hartree
dipole: -2.4810 -2.5812 -0.0515
dipole: 3.5806
quadrupole: -112.1036 -137.1772 -127.6280
quadrupole: 7.8502 -7.2507 7.6572
quadrupole: 13.5327 -11.5409 -1.9917 7.8502 -7.2507 7.6572
hfenergy: -1781.9428189 hartree
pointgroup: C01[X(C10H7Cl1I1N1O1S2)]
dipole: 1.0867106 -0.8911633 0.096626 debye
dipolederiv: -0.4759282 -0.08702 -0.0413643 -0.1074079 0.0472605 -0.0172645 -0.0098713 -0.0134599 0.0632374 -0.2255813 0.1557306 -0.1877508 0.2041567 -0.2812044 0.2819404 -0.2263176 0.2543241 -0.321451 -0.7181814 0.1630118 0.0791518 0.1414763 -0.0897152 -0.074974 0.1048278 -0.0501329 -0.0277293 -0.4891007 0.2803621 0.1334824 0.2605409 -0.6029675 -0.2274807 0.0476588 -0.1934991 -0.1600996 -0.4915831 -0.2167678 -0.0792739 0.1325478 -1.0617083 -0.2550356 0.0886578 -0.2648561 -0.372081 -1.0259482 0.2279943 0.065087 -0.1009249 -1.4308412 -0.4914368 -0.0440505 -0.4528577 -0.2266919 -0.3649544 -0.1003326 -0.0169496 -0.0590597 0.309646 0.1025523 -0.0369207 0.0647789 0.1646002 0.9101263 -0.2595279 -0.1188062 -0.5692971 1.3903441 0.4013217 -0.1046658 0.4174858 0.2858525 0.7755346 0.1720408 0.098808 0.0665535 0.0579398 -0.136843 0.0870186 -0.0648219 0.1713733 1.3355999 -0.1917988 -0.0909949 0.0194174 1.3409597 0.6403312 -0.0476991 0.5112289 0.0198039 0.0667052 -0.0245882 0.0088787 0.0677206 -0.0575673 -0.0808656 -0.0612903 -0.0065374 0.0134308 -0.1665647 0.1423341 -0.1391087 0.047614 -0.0842466 0.0818762 0.0690829 0.1444144 -0.1318516 -0.025201 -0.0772562 0.0546351 0.0326108 -0.0290608 -0.0281947 -0.1339039 -0.0431461 -0.0841844 -0.052774 -0.4971635 0.4120259 -0.2771376 0.3796828 -0.4323467 0.2430334 -0.4388426 0.4446914 -0.4160222 -0.0060239 -0.0662759 -0.0459127 -0.0019629 -0.0688174 -0.0477142 -0.0554407 -0.0334698 1.1008403 0.3348064 -0.0321306 0.2110725 -0.1461937 0.0516449 0.0699831 0.0632249 -0.206744 0.0626766 0.0019558 -0.0144451 0.0430595 -0.0323593 0.0230208 0.001602 0.0203448 -0.0004229 -0.119379 -0.0235512 0.005569 -0.0726048 0.1142863 -0.0008695 -0.0252326 -0.0146177 0.071093 0.1069052 -0.0240378 0.0139834 0.0262104 -0.064215 -0.0627379 0.0595323 -0.0664048 0.0547258 0.0671117 0.0637235 -0.0684111 0.0282337 0.0338674 0.1040536 -0.0343996 0.0568918 -0.0049137 0.0689184 -0.0349366 0.0234042 -0.0464357 0.0680819 0.0425853 0.0352164 0.0214925 0.1082234 0.026007 0.0469379 -0.0587921 0.0439189 0.0885719 0.0653343 -0.0572422 0.0323798 0.0827544 0.050793 -0.0458929 0.0192776 -0.0463525 0.0514019 0.0822058 0.0226946 0.0780512 0.0898532 unknown
polarizability: 280.4289615|-0.5737737|171.9329968|9.7748111|-0.8595615|113.0939172 unknown
InChI: InChI=1S/C10H7ClINOS2/c1-5-9(14)13(10(15)16-5)6-2-3-8(12)7(11)4-6/h2-5H,1H3
charge 0 multiplicity 1
23 atoms
I  -5.169526 -0.907929 -0.114622
Cl -3.326942 1.52721 -1.878904
S  3.537955 1.160437 0.757754
S  0.898405 2.643981 1.279143
O  1.656161 -2.160897 -0.354614
N  1.154161 0.042859 0.347458
C  3.51497 -0.638171 0.140834
C  2.039532 -1.027969 0.015364
C  -0.278871 -0.152543 0.246129
C  1.718039 1.266578 0.781298
C  4.268112 -0.81986 -1.190976
C  -1.028404 0.657722 -0.630749
C  -0.90336 -1.166376 1.002114
C  -2.41755 0.452772 -0.739215
C  -2.293368 -1.363958 0.880349
C  -3.065466 -0.555438 0.012328
H  3.969552 -1.259496 0.931953
H  5.338111 -0.582961 -1.067552
H  4.174624 -1.869876 -1.5202
H  3.85343 -0.164785 -1.975512
H  -0.545404 1.440606 -1.219801
H  -0.317368 -1.800529 1.672149
H  -2.781691 -2.148779 1.463874
