program: Gaussian 09
title: 000217011
version: EM64L-G09RevD.01
frameworkgroup: C1[X(C18H17F3N2O3)]
method: RPBEPBE
basis: SDD
operation: Freq
keyword: #p
keyword: freq=noraman
keyword: PBEPBE/SDD
title: #p freq=noraman PBEPBE/SDD
converged: YES YES NO NO
title: Mulliken charges:
elementType: F F F O O O N N C C C C C C C C C C C C C C C C C C H H H H H H H H H H H H H H H H H
charge: -0.158377 -0.179149 -0.164332 -0.268332 -0.300907 -0.234004 -0.565152 -0.391362 0.308517 0.074142 0.483629 -0.533895 0.339648 -0.373410 -0.331607 -0.395812 0.135314 -0.412957 -0.224120 -0.256783 -0.194312 -0.461595 0.248747 0.282031 -0.281036 -0.653611 0.359038 0.261465 0.267493 0.272318 0.281564 0.269088 0.232169 0.236986 0.238156 0.337804 0.294497 0.264471 0.251607 0.247195 0.231230 0.246508 0.217134
chargesum: 0.00000
title: Mulliken charges with hydrogens summed into heavy atoms:
elementType: F F F O O O N N C C C C C C C C C C C C C C C C C C
charge: -0.158377 -0.179149 -0.164332 -0.268332 -0.300907 -0.234004 -0.206115 -0.053558 0.308517 0.074142 0.483629 -0.272430 0.339648 -0.105916 -0.059289 -0.114248 0.135314 -0.143869 0.008049 -0.019797 0.043844 0.097373 0.248747 0.282031 0.217767 0.041261
chargesum: -0.00001
polarizability: 3.12692062e+02 7.69300662e+00 2.46804712e+02 -1.87615639e+01 6.28076721e+00 1.40382434e+02
1716.lowfreq: -10.2918 -3.5245 -1.2100 -0.4813 -0.1036 -0.0006 3.4359 16.0633 28.9829
frequency: -9.9777 15.9804 28.9482 32.9840 39.0179 43.2879 64.6705 67.3933 80.2431 110.1106 113.7618 129.3616 137.1524 153.4152 198.9778 210.2624 221.4795 240.7581 266.9682 283.8192 305.8559 307.6445 329.9648 334.2164 339.1603 392.3452 406.2443 422.7239 432.5297 454.3498 462.2893 485.3056 515.6193 519.0614 548.8357 559.1845 581.0661 602.0109 611.0091 613.2101 643.4680 671.1681 687.1155 694.6450 719.5988 749.3771 754.6087 773.5131 778.4251 795.7162 805.3297 817.0874 825.4416 876.1486 878.2164 883.5366 902.1998 914.7415 964.3877 968.3719 982.3131 984.8763 986.5259 993.5692 1004.6111 1009.5988 1039.5373 1061.2780 1067.1871 1094.7459 1097.0802 1106.6781 1150.1759 1154.2115 1177.5004 1186.5129 1191.1489 1211.2262 1226.8550 1246.4701 1261.9096 1279.5676 1295.1763 1310.5433 1328.0310 1334.8149 1355.0821 1356.0440 1387.9381 1395.0814 1423.7949 1443.8284 1444.8896 1462.7974 1468.6861 1469.7516 1482.1295 1489.0175 1492.3202 1526.4279 1580.9521 1591.0868 1603.8239 1614.5955 1626.0402 1646.7300 2993.4201 2995.8827 3042.1215 3051.0750 3087.9594 3096.3830 3127.3016 3135.2753 3145.6013 3147.6973 3151.6825 3163.0713 3168.6168 3175.2274 3184.3132 3465.3082 3542.1211
redmass: 14.4692 4.5730 6.9428 3.5416 7.3954 6.9726 6.1643 6.0252 3.8011 4.9902 4.2967 6.9808 4.4911 5.6280 2.2769 2.1052 4.0972 3.0598 3.2376 6.5621 6.6661 6.1720 3.7211 5.9629 6.2723 5.2831 4.2321 4.4426 4.6572 1.6110 3.8721 3.2203 4.1311 8.1507 3.5962 5.2721 6.5649 6.3486 6.0228 5.7322 6.4306 6.0124 4.2785 2.4927 5.6068 2.5160 2.3275 1.2004 1.8551 2.1715 2.1516 1.6142 3.3459 1.5471 3.0354 1.6410 4.9085 1.4085 1.5435 5.0885 5.3397 1.6031 2.1895 1.3368 3.7200 3.6586 2.8857 3.2953 2.7540 2.4045 2.2068 1.8458 3.1407 1.6540 1.0821 1.1813 2.6988 2.1981 1.1293 1.6899 2.3686 1.1217 2.3937 1.4010 1.3996 2.7143 1.8186 1.9701 7.2249 1.2314 3.2597 1.2043 2.1221 1.0435 2.1793 1.1462 1.0611 2.2795 2.6113 2.1058 4.8083 6.8373 4.0350 6.0781 5.7442 10.0280 1.0362 1.0607 1.0606 1.0985 1.0978 1.1011 1.1070 1.0863 1.0876 1.0919 1.0896 1.0943 1.0940 1.1000 1.0971 1.0771 1.0784
irintensity: 0.0219 1.0536 0.8386 0.8901 1.9239 1.1284 1.7119 5.5942 1.7020 5.3622 1.7508 1.8668 0.1882 3.8702 2.2157 3.6155 3.5150 0.1628 2.3261 2.5152 2.6794 12.9075 7.0640 6.9885 2.9623 9.5199 0.8976 9.1443 3.9574 106.4719 17.2783 17.3503 22.7206 0.5671 4.4128 19.9520 15.1481 2.1053 16.4232 5.3875 1.9851 6.5468 23.6951 15.4226 2.4951 27.2278 73.4242 88.0792 40.1238 47.1514 14.1258 2.0889 9.6819 8.5981 51.3418 40.2078 49.3637 11.1048 27.2002 177.6372 24.0024 16.3186 23.7739 3.6863 72.9945 149.5702 12.5674 80.4847 45.3454 1.1494 15.7100 3.7155 100.0163 11.7513 15.3605 14.8145 98.0639 61.2153 24.8655 64.9423 159.1779 1.8112 64.4436 41.2465 24.7885 299.8860 4.7874 10.9373 10.1305 24.9761 4.2416 2.0501 111.0745 17.4273 16.4619 27.0639 13.1700 132.3815 294.7177 177.0033 39.0748 286.7273 5.4735 197.7515 15.7789 241.9382 10.7669 39.4429 14.1499 8.8625 27.9480 10.4944 17.3037 4.6158 11.9915 4.4790 6.6379 12.7424 1.7062 18.3634 3.2398 108.3564 28.1925
temp: 298.150 k
press: 1.00000 atm
elementType: 9 9 9 8 8 8 7 7 6 6 6 6 6 6 6 6 6 6 6 6 6 6 6 6 6 6 1 1 1 1 1 1 1 1 1 1 1 1 1 1 1 1 1
symmnumber: 1
zpe: 843849.0 jmol-1
zpe.correction: 0.321405 hartree
zpe.thermalcorrener: 0.345084 hartree
zpe.thermalcorrenthalpy: 0.346028 hartree
zpe.thermalcorrgfe: 0.265543 hartree
zpe.sumelectzpe: -1328.968411 hartree
zpe.sumelectthermal: -1328.944732 hartree
zpe.sumelectthermalent: -1328.943788 hartree
zpe.sumelectthermalfe: -1329.024273 hartree
dipole: 0.3130 -3.9971 -2.4004
dipole: 4.6730
quadrupole: -171.3870 -148.5945 -149.7441
quadrupole: 10.4530 1.4140 5.5648
quadrupole: -14.8118 7.9807 6.8311 10.4530 1.4140 5.5648
hfenergy: -1329.2898161 hartree
pointgroup: C01 [X(C18H17F3N2O3)]
dipole: 0.3031109 -1.4426122 -1.0986436 debye
polarizability: 306.2811833|19.7661559|249.1966881|-27.027302|12.1680377|144.4013379 unknown
InChI: InChI=1S/C18H17F3N2O3/c1-2-26-16(24)11-22-17(25)14-8-3-4-9-15(14)23-13-7-5-6-12(10-13)18(19,20)21/h3-10,22-23H,2,11H2,1H3
charge 0 multiplicity 1
43 atoms
F  5.477761 0.086827 -0.569393
F  3.971137 1.713631 -0.076115
F  4.41268 0.08819 1.433118
O  -4.330266 0.74529 0.849405
O  -0.490614 2.583222 -0.098816
O  -1.578904 4.623239 -0.448095
N  -0.572961 -0.781543 -0.098227
N  -2.657734 1.105599 -0.72265
C  -1.66978 -1.678413 0.019205
C  -3.005632 -1.174842 0.160383
C  0.727426 -1.070794 -0.566429
C  1.814447 -0.324107 -0.042034
C  3.119658 -0.518809 -0.542769
C  -1.458965 -3.084146 0.090648
C  -4.06948 -2.083005 0.394641
C  0.987313 -2.025823 -1.593063
C  -3.380996 0.284761 0.140471
C  3.382361 -1.472268 -1.550942
C  -2.538143 -3.967611 0.280454
C  -3.85484 -3.472878 0.43741
C  2.29948 -2.221409 -2.064694
C  -2.849297 2.548515 -0.733105
C  4.227592 0.309455 0.03952
C  -1.602737 3.374821 -0.410385
C  0.780719 3.328868 0.219476
C  0.90728 3.535519 1.729124
H  -0.694992 0.156331 0.300552
H  1.634315 0.394219 0.76521
H  -0.440869 -3.480324 0.046986
H  -5.068087 -1.660007 0.544118
H  0.160767 -2.587964 -2.036709
H  4.398163 -1.617835 -1.926681
H  -2.343789 -5.044475 0.336309
H  -4.691701 -4.158228 0.60268
H  2.479121 -2.955127 -2.857262
H  -1.954182 0.692914 -1.337828
H  -3.628011 2.777389 0.019015
H  -3.232116 2.91336 -1.705675
H  0.755444 4.290483 -0.320372
H  1.576481 2.686042 -0.186328
H  1.882112 4.005462 1.954167
H  0.109585 4.196797 2.107212
H  0.85985 2.575976 2.273865
