program: Gaussian 09
title: 000216965
version: EM64L-G09RevD.01
frameworkgroup: C1[X(C9H17N2O3PS2)]
method: RPBEPBE
basis: SDD
operation: Freq
keyword: #p
keyword: freq=noraman
keyword: PBEPBE/SDD
title: #p freq=noraman PBEPBE/SDD
converged: YES YES NO NO
title: Mulliken charges:
elementType: S S P O O O N N C C C C C C C C C H H H H H H H H H H H H H H H H H
charge: 0.067987 -0.225721 0.591795 -0.235264 -0.477875 -0.445677 -0.115258 -0.151842 -0.040645 -0.515689 -0.693267 -0.691954 0.219994 0.345933 -0.812936 -0.501905 -0.477336 0.212146 0.234261 0.245837 0.228553 0.217677 0.214455 0.215262 0.230084 0.212661 0.340532 0.305053 0.240721 0.296907 0.236235 0.240739 0.247186 0.241350
chargesum: 0.00000
title: Mulliken charges with hydrogens summed into heavy atoms:
elementType: S S P O O O N N C C C C C C C C C
charge: 0.067987 -0.225721 0.591795 -0.235264 -0.477875 -0.445677 -0.115258 -0.151842 0.171501 -0.035591 -0.032580 -0.033948 0.219994 0.345933 -0.167352 0.271958 0.251939
polarizability: 2.45220638e+02 1.13643209e+01 1.61527407e+02 1.19838018e+01 5.67198415e+00 1.63262088e+02
1716.lowfreq: -12.5653 -6.7403 -1.7865 -0.0023 0.0006 0.0011 10.8203 14.1690 29.2751
frequency: 9.6145 11.1123 29.0697 39.2261 58.1320 75.5956 84.6132 105.0633 115.2435 120.0745 124.6218 131.3293 142.2232 148.9358 169.1457 196.1644 224.3357 232.1156 249.2837 251.1348 268.1751 309.2094 338.5570 347.2849 373.7195 379.4702 389.4329 417.0007 502.2500 533.7127 583.2002 623.2045 635.6916 674.5416 689.4029 728.9840 750.9945 792.2769 828.0227 869.4014 887.6888 902.5160 924.0227 938.5547 950.2994 954.6866 960.6459 973.9413 1058.2547 1101.7297 1106.3521 1111.2871 1125.8528 1128.2869 1139.4530 1170.0669 1187.7620 1239.1026 1259.9734 1270.5167 1309.1387 1331.5833 1349.4761 1387.3212 1406.0272 1418.2006 1419.7212 1430.7788 1443.2718 1453.8913 1463.2969 1463.5730 1468.1317 1472.2413 1478.5366 1481.9800 1485.6437 1491.2318 1513.9316 2976.1936 2978.1282 2978.3412 2981.2340 2985.4473 3008.8007 3050.6957 3071.4212 3075.2445 3076.4211 3079.2747 3081.9364 3090.3072 3091.3802 3122.3491 3133.5653 3134.8954
redmass: 3.6065 6.4795 4.6606 4.6173 3.2144 3.2497 4.3909 3.8824 6.0368 1.2126 1.3149 2.4274 4.9446 4.7824 5.2948 1.1713 1.0520 5.9321 3.5893 4.4901 7.9673 6.9617 2.4245 3.6422 5.6573 3.0049 2.0257 8.2172 3.2075 16.5456 7.2259 6.3967 11.1196 11.2423 6.7436 8.3194 5.2354 2.9255 2.2689 3.1276 3.6860 4.2366 1.2293 11.2768 2.2680 10.9820 1.5941 3.4698 2.3542 1.5537 1.2432 1.9542 1.2853 1.2642 1.2648 1.8305 2.0848 1.3120 1.1605 1.4822 2.0073 1.5154 1.5189 1.2123 1.2112 1.1143 1.1207 1.1124 1.1102 1.0510 1.0439 1.0489 1.0521 1.0741 1.0530 1.0464 1.1320 4.9614 8.1291 1.0767 1.0384 1.0295 1.0387 1.0296 1.0621 1.0589 1.1007 1.0999 1.1004 1.0996 1.0991 1.1053 1.1065 1.1039 1.1031 1.1074
irintensity: 0.2442 0.2039 0.8078 3.2910 2.3048 3.8011 1.3023 1.6466 1.7581 1.7786 0.5960 1.5253 2.2057 0.5719 4.3072 0.2922 0.5745 16.9299 4.5329 6.2922 6.6360 9.5540 2.1951 0.7254 8.8063 0.5535 0.7424 34.3922 2.4632 144.0988 2.9067 3.2778 89.1656 99.6244 18.4413 16.8985 11.1722 10.4323 3.0480 8.8919 5.5451 32.6391 2.5615 173.6170 0.8551 118.8661 2.2932 10.7401 1.0948 2.9282 0.1196 13.1521 0.4976 2.6010 0.9715 12.5887 10.1294 5.9051 7.5580 22.5753 7.3861 2.0802 13.1686 20.9012 11.2295 15.0773 1.8388 14.3136 10.6281 18.4907 1.5264 4.9039 16.9030 3.3924 11.0374 16.9260 12.3462 53.7695 33.7582 27.8419 25.6095 46.5936 12.6498 48.7607 25.0818 7.2980 10.0185 6.5335 24.0207 33.9530 94.3111 22.9324 0.8208 8.0422 10.5949 6.7581
temp: 298.150 k
press: 1.00000 atm
elementType: 16 16 15 8 8 8 7 7 6 6 6 6 6 6 6 6 6 1 1 1 1 1 1 1 1 1 1 1 1 1 1 1 1 1
symmnumber: 1
zpe: 682626.1 jmol-1
zpe.correction: 0.259999 hartree
zpe.thermalcorrener: 0.281920 hartree
zpe.thermalcorrenthalpy: 0.282864 hartree
zpe.thermalcorrgfe: 0.204418 hartree
zpe.sumelectzpe: -1824.285598 hartree
zpe.sumelectthermal: -1824.263677 hartree
zpe.sumelectthermalent: -1824.262733 hartree
zpe.sumelectthermalfe: -1824.341178 hartree
dipole: -1.5574 -1.6173 -1.6725
dipole: 2.7997
quadrupole: -99.0506 -131.3926 -127.2555
quadrupole: -11.3062 3.4060 2.9186
quadrupole: 20.1823 -12.1597 -8.0226 -11.3062 3.4060 2.9186
hfenergy: -1824.5455969 hartree
pointgroup: C01 [X(C9H17N2O3P1S2)]
dipole: 0.6244661 0.2300276 -0.877739 debye
polarizability: 243.8937899|15.2295521|159.3487591|-12.6744345|-2.8141972|166.7675844 unknown
InChI: InChI=1S/C7H11N2OS.C2H6O2PS/c1-5(2)3-6-8-9-7(4-11)10-6;1-3-5(6)4-2/h5H,3-4H2,1-2H3;1-2H3
charge 0 multiplicity 1
34 atoms
S  -1.000653 -1.939581 -0.526192
S  -3.689575 -1.725151 2.037945
P  -3.057031 -1.179241 0.153309
O  1.943561 -0.169104 -1.143586
O  -3.074338 0.524127 -0.219217
O  -3.963566 -1.702308 -1.228884
N  1.906762 1.722726 0.127397
N  0.555377 1.416662 -0.283391
C  4.610801 -0.45199 0.813818
C  4.168871 0.603837 -0.257445
C  4.134131 -0.057952 2.230167
C  4.166384 -1.885665 0.443175
C  2.6934 0.775451 -0.387509
C  0.616787 0.307723 -1.020717
C  -0.488572 -0.457211 -1.639811
C  -2.711131 1.520158 0.826742
C  -5.435546 -1.508902 -1.191384
H  5.720128 -0.422954 0.802061
H  4.5854 0.317254 -1.241244
H  4.584006 1.589892 0.016472
H  3.031156 -0.075427 2.302483
H  4.470182 0.958981 2.50381
H  4.532435 -0.765186 2.980198
H  4.582425 -2.613353 1.163544
H  3.06594 -1.984974 0.462859
H  4.512087 -2.170369 -0.56792
H  -1.377373 0.183973 -1.745781
H  -0.206456 -0.894568 -2.608246
H  -3.239298 2.438664 0.528313
H  -1.619899 1.681416 0.812256
H  -3.059945 1.183472 1.820283
H  -5.869348 -2.002472 -0.302714
H  -5.79696 -1.991513 -2.111124
H  -5.684244 -0.433316 -1.195467
