program: Gaussian 09
title: 000211681
version: EM64L-G09RevD.01
frameworkgroup: C1[X(C15H18BrClN2S2)]
method: RPBEPBE
basis: SDD
operation: Freq
keyword: #p
keyword: freq=noraman
keyword: PBEPBE/SDD
title: #p freq=noraman PBEPBE/SDD
converged: YES YES NO NO
title: Mulliken charges:
elementType: Br Cl S S N N C C C C C C C C C C C C C C C H H H H H H H H H H H H H H H H H H
charge: 0.060290 -0.010361 0.268514 0.079595 -0.047808 -0.081699 -0.000643 -0.423121 -0.402507 -0.391974 -0.404686 -0.388820 -0.431575 -0.687175 -0.662240 0.488429 -0.318950 -0.328172 -0.042746 -0.161902 -0.229680 0.193795 0.186158 0.217563 0.226306 0.211437 0.205556 0.195612 0.194603 0.208263 0.205523 0.193303 0.259619 0.260703 0.267911 0.289353 0.269961 0.275892 0.255673
chargesum: 0.00000
title: Mulliken charges with hydrogens summed into heavy atoms:
elementType: Br Cl S S N N C C C C C C C C C C C C C C C
charge: 0.060290 -0.010361 0.268514 0.079595 -0.047808 -0.081699 0.193152 -0.019400 0.035236 0.009194 -0.001819 0.010006 0.088747 -0.129911 -0.662240 0.488429 -0.048990 -0.052279 -0.042746 0.093771 -0.229680
polarizability: 3.22874246e+02 -2.43599519e+01 1.99694170e+02 9.29244376e+00 9.06361496e+00 2.08107548e+02
1716.lowfreq: -14.1033 -6.2850 -0.0015 0.0005 0.0012 1.3709 16.9234 20.8272 33.3283
frequency: 16.9130 20.4345 33.1633 42.4428 52.0772 81.3339 102.3648 111.7315 138.4581 150.3501 162.9272 192.1589 210.8775 225.6786 247.1332 262.6035 291.1990 304.3733 330.6905 342.3695 366.2537 383.5888 410.8133 428.0331 436.3737 444.2316 452.4674 467.7359 493.1538 522.9407 535.1070 540.5567 578.3534 620.2317 655.1024 680.3122 698.2577 775.7690 780.9486 811.1330 828.8900 836.2217 862.7821 869.7598 881.1854 890.6842 894.2101 916.0456 917.9262 952.0838 973.0112 992.0852 1001.0759 1044.7914 1047.2268 1053.7750 1070.1351 1088.3113 1106.4297 1110.9232 1127.7894 1143.3249 1166.7347 1189.4431 1196.3396 1231.8755 1246.3651 1253.0002 1254.7651 1262.2418 1271.7570 1293.0690 1302.0841 1324.3141 1331.1447 1335.4985 1340.4537 1343.2063 1353.0477 1358.4258 1379.8580 1388.1296 1400.3117 1448.9647 1453.0869 1455.5742 1463.1719 1464.6279 1465.6675 1473.0325 1479.5018 1557.7316 1586.5147 2965.5622 2967.5140 2969.8056 2971.5465 2974.3397 2985.8203 2992.2493 3033.5134 3034.3244 3041.6437 3041.8100 3046.7896 3056.4252 3096.6449 3136.1560 3163.0098 3166.7684 3183.9146
redmass: 6.0666 9.0749 3.2224 9.8327 6.9218 7.8335 6.1279 3.6104 5.8928 11.0774 12.1272 5.1256 2.3351 3.4859 7.9078 2.6361 8.0388 3.2311 2.7490 5.4521 8.4155 3.0248 4.3330 5.1427 3.8069 3.0556 4.1307 6.2777 1.7845 3.2953 6.4614 5.3731 4.3438 5.9937 7.0060 7.1484 3.5900 2.1867 1.4514 1.5128 4.6671 2.8095 1.6264 1.6437 1.5778 2.2737 2.0201 2.3444 2.5102 1.3825 3.4598 5.3483 2.4842 1.6331 1.9297 1.4383 1.4692 2.1557 2.2561 2.4381 2.2229 1.3652 2.4873 1.5190 1.8273 1.4150 1.2401 1.2973 1.4163 1.3017 1.4913 2.4372 1.2685 1.4028 1.5208 1.3805 1.4858 1.5917 2.8057 1.7105 3.3389 1.6424 1.7944 1.2258 1.8288 1.1521 1.1293 1.1211 1.0878 1.0851 1.0967 8.2624 6.7349 1.0725 1.0663 1.0674 1.0597 1.0685 1.0655 1.0647 1.0973 1.0951 1.0908 1.0678 1.1013 1.1016 1.1011 1.1090 1.0889 1.0924 1.0973
irintensity: 0.0533 0.2967 0.1515 1.3295 0.5748 1.0168 1.0460 0.6028 2.7593 0.5707 1.0135 0.1021 0.3277 0.8053 4.6474 0.6359 0.5105 0.6965 1.4614 6.9540 6.1194 1.5646 2.5257 11.4859 3.3167 5.1517 10.9178 8.7819 0.7602 12.3107 22.2900 7.6867 1.7325 25.4406 17.1653 46.4335 6.3923 0.6466 0.1984 19.3721 59.2817 12.7161 12.7266 3.6030 5.8112 18.1937 9.1489 0.6336 4.8912 6.7361 105.6788 51.9394 4.6578 1.7089 44.6513 39.3664 3.3302 138.3260 58.0426 0.3628 7.1224 3.2790 7.3084 19.7170 63.2257 25.7516 8.5780 3.7590 54.5055 23.6812 21.8013 164.2011 0.1134 1.6275 21.7748 0.7630 1.0427 24.9997 10.9906 16.4433 13.7588 38.8803 63.7140 88.0223 127.2070 8.4762 5.8814 11.9825 8.3169 27.5991 3.2814 45.1528 13.6843 14.9217 16.0519 29.3817 36.4282 16.8179 33.0778 30.5124 63.9955 64.9353 4.0479 46.1296 39.3496 69.1277 9.7846 7.0436 2.4229 1.9412 2.4798
temp: 298.150 k
press: 1.00000 atm
elementType: 35 17 16 16 7 7 6 6 6 6 6 6 6 6 6 6 6 6 6 6 6 1 1 1 1 1 1 1 1 1 1 1 1 1 1 1 1 1 1
symmnumber: 1
zpe: 794960.9 jmol-1
zpe.correction: 0.302785 hartree
zpe.thermalcorrener: 0.323613 hartree
zpe.thermalcorrenthalpy: 0.324557 hartree
zpe.thermalcorrgfe: 0.249636 hartree
zpe.sumelectzpe: -1959.958570 hartree
zpe.sumelectthermal: -1959.937742 hartree
zpe.sumelectthermalent: -1959.936797 hartree
zpe.sumelectthermalfe: -1960.011719 hartree
dipole: 4.0355 4.5471 2.6081
dipole: 6.6154
quadrupole: -154.1538 -169.1670 -153.8034
quadrupole: 6.5497 8.7951 -12.3750
quadrupole: 4.8876 -10.1256 5.2380 6.5497 8.7951 -12.3750
hfenergy: -1960.2613544 hartree
pointgroup: C01 [X(C15H18Br1Cl1N2S2)]
dipole: 2.2501558 0.602642 1.1608678 debye
polarizability: 279.6895418|-64.0205115|237.8249489|-7.507649|14.5492664|213.1614726 unknown
InChI: InChI=1S/C15H18BrClN2S2/c16-13-7-6-12(8-14(13)17)19-9-18(10-21-15(19)20)11-4-2-1-3-5-11/h6-8,11H,1-5,9-10H2
charge 0 multiplicity 1
39 atoms
Br -4.420422 3.779726 0.447519
Cl -4.146418 1.333594 2.7915
S  1.15401 -2.927199 -1.188849
S  -1.35689 -1.812066 -2.376606
N  1.961531 -1.181359 0.939849
N  -0.333081 -0.894904 0.007409
C  2.698008 0.054111 0.523748
C  4.134108 0.051909 1.105354
C  2.727173 0.314872 -1.00872
C  4.877032 1.369607 0.776349
C  3.468567 1.635629 -1.330231
C  4.900321 1.642414 -0.746256
C  0.552815 -1.074848 1.24276
C  2.308212 -2.450635 0.374465
C  -0.247934 -1.748026 -1.085808
C  -1.320601 0.156055 0.071778
C  -2.173331 0.230742 1.197438
C  -1.401458 1.151205 -0.934501
C  -3.087425 1.298373 1.320676
C  -2.323329 2.205544 -0.807545
C  -3.171767 2.291127 0.322904
H  2.146183 0.893592 0.997186
H  4.704855 -0.79938 0.679073
H  4.081813 -0.108224 2.198404
H  1.698844 0.347725 -1.41165
H  3.240405 -0.526124 -1.516184
H  5.907474 1.326351 1.177722
H  4.370452 2.21261 1.290429
H  2.898477 2.489503 -0.907958
H  3.499075 1.785802 -2.426208
H  5.394008 2.611207 -0.952902
H  5.504704 0.859839 -1.249805
H  0.358337 -0.20325 1.885941
H  0.229322 -1.99721 1.762786
H  3.334437 -2.469842 -0.016801
H  2.137835 -3.279895 1.078041
H  -2.157052 -0.549919 1.963401
H  -0.757955 1.091715 -1.81545
H  -2.387535 2.972628 -1.584256
