program: Gaussian 09
title: 000211677
version: EM64L-G09RevD.01
frameworkgroup: C1[X(C15H18Cl2N2S2)]
method: RPBEPBE
basis: SDD
operation: Freq
keyword: #p
keyword: freq=noraman
keyword: PBEPBE/SDD
title: #p freq=noraman PBEPBE/SDD
converged: YES YES NO NO
title: Mulliken charges:
elementType: Cl Cl S S N N C C C C C C C C C C C C C C C H H H H H H H H H H H H H H H H H H
charge: -0.011478 -0.000347 0.268266 0.079147 -0.047867 -0.082458 0.000503 -0.423926 -0.402474 -0.391696 -0.405014 -0.388758 -0.431118 -0.687398 -0.663327 0.492042 -0.324937 -0.323089 -0.054676 -0.190833 -0.128302 0.193365 0.186316 0.217565 0.226254 0.211496 0.205556 0.195467 0.194388 0.208316 0.205483 0.193346 0.259199 0.260572 0.267948 0.289228 0.267565 0.274435 0.261243
chargesum: 0.00000
title: Mulliken charges with hydrogens summed into heavy atoms:
elementType: Cl Cl S S N N C C C C C C C C C C C C C C C
charge: -0.011478 -0.000347 0.268266 0.079147 -0.047867 -0.082458 0.193868 -0.020045 0.035275 0.009327 -0.002311 0.010072 0.088653 -0.130221 -0.663327 0.492042 -0.057371 -0.048655 -0.054676 0.070410 -0.128302
polarizability: 2.99620917e+02 -2.61327293e+01 2.01022283e+02 -1.23925238e+01 -9.07851887e+00 2.05412347e+02
1716.lowfreq: -20.7911 -9.0335 -0.0018 -0.0017 0.0011 4.6482 15.0645 19.8231 32.0471
frequency: 10.3690 19.3615 31.9603 42.9301 57.2370 82.5728 99.6400 112.9799 141.5022 163.7806 185.3600 201.2366 212.1881 225.2513 261.1368 271.3251 293.8313 306.7772 328.3302 350.7293 377.2304 392.1693 411.1058 435.6234 441.8556 448.1613 456.6720 485.3564 490.1866 522.7035 535.1088 540.5762 582.4134 626.4954 660.1302 683.3787 696.6787 776.5341 780.7707 809.3638 831.0925 836.1658 862.5068 871.8506 880.2684 889.4724 893.9385 915.5069 918.5564 947.1530 973.0355 999.0672 1002.0852 1044.4521 1047.9547 1053.2033 1070.0121 1086.8763 1110.1318 1116.8214 1127.8430 1142.0549 1166.6425 1188.8183 1196.7287 1233.7886 1245.7953 1253.1350 1255.9241 1261.1259 1271.3404 1293.7511 1301.2699 1325.2220 1329.7385 1334.5921 1341.5325 1344.1173 1355.2009 1358.8892 1382.7273 1392.4551 1403.0065 1447.6921 1456.1908 1456.8756 1463.1746 1465.3282 1466.0839 1470.1916 1477.6737 1563.2495 1590.1383 2963.3419 2966.5283 2969.0647 2970.9152 2973.7924 2988.7004 2992.5648 3033.3849 3034.1810 3041.1460 3041.5959 3046.6601 3058.0575 3097.3783 3135.9424 3163.4813 3167.2301 3184.6329
redmass: 5.5466 7.3108 3.3003 9.0493 9.1688 7.7843 3.9357 4.9714 5.3147 10.8736 10.6739 4.8604 2.1628 4.0429 2.6320 10.7846 8.4066 3.1127 2.7768 5.7607 3.6059 6.2120 4.0786 3.3642 4.4805 2.9949 5.0884 8.2872 1.8129 3.1270 6.0262 6.4265 4.1495 6.1596 7.2711 6.9263 3.6968 2.1986 1.4489 1.4603 4.6554 2.9727 1.6102 1.7310 1.5686 1.8698 2.3975 2.2332 2.6199 1.3681 3.4545 4.7169 2.6098 1.8518 1.8833 1.3811 1.4385 2.0775 2.4274 2.2077 2.2561 1.3535 2.5073 1.5059 1.8841 1.4049 1.2476 1.3811 1.3505 1.3002 1.5337 2.4657 1.2736 1.4094 1.4818 1.3892 1.4596 1.5469 2.4949 1.9161 3.5308 1.6628 1.7070 1.1195 1.1242 1.8131 1.3281 1.0918 1.0929 1.0846 1.0965 8.2818 6.9088 1.0697 1.0656 1.0675 1.0603 1.0732 1.0647 1.0649 1.0971 1.0950 1.0973 1.0610 1.1013 1.1009 1.1010 1.1090 1.0891 1.0925 1.0973
irintensity: 0.0916 0.1942 0.1647 1.1874 0.8593 1.0826 0.4795 0.8939 3.3743 1.6681 0.1150 0.5403 0.4941 1.5308 0.6470 2.3443 0.2364 0.8639 1.2720 8.4584 1.4251 2.4833 2.1440 2.5648 10.5509 3.7678 7.8780 26.4957 0.3356 11.2674 18.8122 9.3327 0.6932 35.1063 13.1791 43.0440 5.7078 0.5765 0.2080 17.6406 46.1775 20.6649 12.4461 2.8134 6.3976 21.5198 5.1717 0.7912 4.9511 5.4672 116.8285 29.2143 11.4771 15.7644 30.3837 44.1152 3.4126 135.9032 0.2064 66.8497 10.0166 0.7547 7.3847 18.0517 60.1790 24.3360 6.6148 39.1789 14.8775 26.5609 21.1401 157.8235 1.6332 1.4042 19.5326 0.5900 0.9914 18.4605 18.8450 10.5162 12.8268 51.0586 47.0043 35.0349 19.6901 144.3265 35.4520 3.9214 10.6390 30.0692 3.8318 42.3578 12.6647 19.8890 11.9122 29.6669 32.4507 23.0468 29.3133 30.5776 62.0518 67.0659 9.7908 40.0281 48.6689 59.7619 9.6210 7.0111 1.9707 1.7455 2.2073
temp: 298.150 k
press: 1.00000 atm
elementType: 17 17 16 16 7 7 6 6 6 6 6 6 6 6 6 6 6 6 6 6 6 1 1 1 1 1 1 1 1 1 1 1 1 1 1 1 1 1 1
symmnumber: 1
zpe: 796067.3 jmol-1
zpe.correction: 0.303206 hartree
zpe.thermalcorrener: 0.323856 hartree
zpe.thermalcorrenthalpy: 0.324800 hartree
zpe.thermalcorrgfe: 0.250303 hartree
zpe.sumelectzpe: -2406.559006 hartree
zpe.sumelectthermal: -2406.538355 hartree
zpe.sumelectthermalent: -2406.537411 hartree
zpe.sumelectthermalfe: -2406.611908 hartree
dipole: -4.4115 -4.3057 2.5285
dipole: 6.6629
quadrupole: -156.9067 -168.2233 -149.2753
quadrupole: 5.7170 -5.1081 11.3652
quadrupole: 1.2284 -10.0882 8.8598 5.7170 -5.1081 11.3652
hfenergy: -2406.8622116 hartree
pointgroup: C01 [X(C15H18Cl2N2S2)]
dipole: 2.2737169 0.5660057 1.1753387 debye
polarizability: 269.7341607|-53.4643862|224.6446963|-6.9219921|13.660611|211.6766896 unknown
InChI: InChI=1S/C15H18Cl2N2S2/c16-13-7-6-12(8-14(13)17)19-9-18(10-21-15(19)20)11-4-2-1-3-5-11/h6-8,11H,1-5,9-10H2
charge 0 multiplicity 1
39 atoms
Cl -4.183018 1.342688 2.751705
Cl -4.324269 3.678471 0.43034
S  1.149503 -2.928355 -1.187271
S  -1.347847 -1.80134 -2.39284
N  1.950735 -1.183221 0.944632
N  -0.338443 -0.891823 0.000063
C  2.691557 0.050391 0.530577
C  4.125447 0.04626 1.11762
C  2.72729 0.309599 -1.002067
C  4.871735 1.362488 0.7902
C  3.471664 1.629044 -1.321883
C  4.901195 1.634104 -0.732539
C  0.540613 -1.073165 1.23998
C  2.297082 -2.453698 0.381233
C  -0.248732 -1.743664 -1.093411
C  -1.324872 0.16096 0.060508
C  -2.189174 0.229198 1.178571
C  -1.391973 1.1623 -0.94104
C  -3.1006 1.298505 1.299771
C  -2.312001 2.218878 -0.817317
C  -3.16671 2.29424 0.305779
H  2.139502 0.891348 1.001152
H  4.696439 -0.806322 0.694312
H  4.068852 -0.112641 2.21065
H  1.700825 0.343223 -1.409595
H  3.241648 -0.532553 -1.506476
H  5.900596 1.317848 1.195456
H  4.364619 2.206736 1.301709
H  2.901218 2.484037 -0.90233
H  3.506493 1.778364 -2.417845
H  5.397261 2.601944 -0.937967
H  5.506173 0.850185 -1.233253
H  0.344698 -0.200694 1.881569
H  0.212336 -1.994453 1.758968
H  3.325191 -2.475448 -0.004862
H  2.121527 -3.281933 1.084704
H  -2.182343 -0.557016 1.93898
H  -0.739158 1.105131 -1.815215
H  -2.37146 2.993984 -1.586665
