program: Gaussian 09
title: 000015250
version: EM64L-G09RevD.01
frameworkgroup: C1[X(C12H16O2)]
method: RPBEPBE
basis: SDD
operation: Freq
keyword: #pfreq=noraman
keyword: PBEPBE/SDD
title: #p freq=noraman PBEPBE/SDD
converged: YES YES NO NO
title: Mulliken charges:
elementType: O O C C C C C C C C C C C C H H H H H H H H H H H H H H H H
charge: -0.417961 -0.214954 -0.024953 -0.588584 0.492898 -0.703495 -0.703827 -0.399037 -0.398870 0.498437 -0.397562 -0.396154 -0.670303 0.194388 0.198599 0.207049 0.206951 0.235876 0.202268 0.211500 0.211584 0.236081 0.202294 0.231376 0.231470 0.227210 0.227044 0.262305 0.262201 0.376170
chargesum: 0.00000
title: Mulliken charges with hydrogens summed into heavy atoms:
elementType: O O C C C C C C C C C C C C
charge: -0.041791 -0.214954 0.173646 -0.174584 0.492898 -0.053851 -0.053869 -0.167661 -0.167401 0.498437 -0.170352 -0.169111 -0.145797 0.194388
polarizability: 1.78131228e+02 3.13202671e+00 9.95610986e+01 3.00449687e-01 5.82084437e-01 1.20773735e+02
1716.lowfreq: -14.7523 -7.8605 -3.0509 -0.0006 -0.0004 0.0006 8.0045 19.4584 40.5821
frequency: -9.2991 19.3838 40.5674 46.6395 89.0526 109.7603 188.5117 216.9468 247.3229 250.2096 308.0464 326.5028 332.6064 370.7170 390.5157 407.5869 471.1408 486.0418 490.3679 565.0580 633.4772 636.0737 641.3003 705.4390 763.9334 800.1804 814.1631 850.1495 851.6577 873.4991 879.4643 918.2632 924.0204 949.4659 961.3292 964.0182 972.6787 1015.8199 1036.5279 1074.5940 1087.2701 1125.9117 1177.0646 1180.6553 1195.0377 1213.5303 1220.1871 1222.8150 1253.8553 1266.7979 1317.6421 1331.2165 1334.1778 1346.8740 1378.6126 1384.0670 1396.0512 1412.3385 1441.4153 1464.2083 1466.6818 1475.6910 1482.7782 1490.8071 1511.4468 1585.4983 1627.0427 1678.0068 2955.7812 2969.8647 2971.6184 2979.9562 3000.5735 3029.8655 3052.4240 3062.0010 3066.6222 3071.4774 3077.4578 3112.1952 3113.9796 3134.6136 3141.4192 3514.1966
redmass: 7.4905 4.0634 5.3015 3.0822 2.5948 5.1428 5.3103 1.1418 2.2272 1.0628 6.7252 2.2182 3.5018 2.4660 1.7795 2.7720 3.4831 3.2375 2.1354 3.8830 1.7936 2.9481 3.0529 4.0082 3.2570 2.9087 2.6568 1.2925 3.6956 2.4568 1.5641 1.4610 1.5655 1.7191 1.5372 1.5819 1.3780 2.9381 2.6765 1.6391 1.4835 1.3649 1.1496 2.0651 1.1023 1.9362 2.4649 1.2658 2.0132 1.4991 1.3111 1.4549 1.9736 1.3911 1.2309 5.7440 1.2188 2.6064 1.1108 1.0442 1.0953 1.0546 1.0536 1.0553 2.7592 6.6107 6.5041 8.3723 1.0780 1.0353 1.0411 1.0603 1.0610 1.1023 1.0986 1.0997 1.0985 1.1000 1.0992 1.0871 1.0873 1.0961 1.0973 1.0640
irintensity: 0.6545 0.0293 0.8442 0.0096 0.1515 0.5684 0.7428 0.1144 0.6457 0.4105 1.7559 0.5016 2.2430 0.0598 0.2017 0.0609 28.6637 13.8535 20.7502 16.9028 90.6232 25.5137 45.7543 3.5296 6.0619 26.8661 9.4578 0.9326 15.7370 22.2008 1.4492 0.1844 2.9760 2.3651 0.0025 1.0776 0.0249 5.0213 347.0942 0.5765 4.1599 13.3293 0.2986 5.4266 0.5515 0.9690 4.7117 0.8075 12.3329 18.0511 0.0828 0.9725 55.1349 8.3338 21.8810 1.1737 13.5077 6.2742 33.7043 3.5859 3.9364 0.0357 19.9693 17.1027 22.8398 0.0012 4.4916 184.5876 20.1847 44.9754 34.6403 55.1401 16.9015 20.5044 3.1433 22.7688 63.5290 5.8949 95.6919 0.5794 27.6962 43.6051 0.2949 21.1376
temp: 298.150 k
press: 1.00000 atm
elementType: 8 8 6 6 6 6 6 6 6 6 6 6 6 6 1 1 1 1 1 1 1 1 1 1 1 1 1 1 1 1
symmnumber: 1
zpe: 657615.7 jmol-1
zpe.correction: 0.250473 hartree
zpe.thermalcorrener: 0.264175 hartree
zpe.thermalcorrenthalpy: 0.265120 hartree
zpe.thermalcorrgfe: 0.208404 hartree
zpe.sumelectzpe: -616.280435 hartree
zpe.sumelectthermal: -616.266733 hartree
zpe.sumelectthermalent: -616.265788 hartree
zpe.sumelectthermalfe: -616.322504 hartree
dipole: -0.1443 -1.0046 -0.0110
dipole: 1.0150
quadrupole: -72.0635 -89.0527 -78.9932
quadrupole: -1.9880 0.0305 -0.0317
quadrupole: 7.9729 -9.0162 1.0433 -1.9880 0.0305 -0.0317
hfenergy: -616.530908 hartree
pointgroup: C01 [X(C12H16O2)]
dipole: -0.0504112 -0.3958692 -0.0141784 debye
polarizability: 178.0106693|4.4052587|99.66818|-0.0754402|0.0022375|120.7872115 unknown
InChI: InChI=1S/C12H16O2/c1-9(2)7-10-3-5-11(6-4-10)8-12(13)14/h3-6,9,13H,7-8H2,1-2H3
charge 0 multiplicity 1
30 atoms
O  -4.880476 0.595417 0.013515
O  -2.867785 1.751436 0.089987
C  3.690187 0.586944 -0.023942
C  3.018807 -0.830179 -0.031261
C  1.496814 -0.8285 -0.015606
C  3.336926 1.410038 -1.284625
C  3.367706 1.383302 1.261829
C  0.749505 -0.816519 -1.222556
C  0.774164 -0.833181 1.206309
C  -1.375114 -0.788348 0.013852
C  -0.661571 -0.795346 -1.209113
C  -0.636844 -0.811583 1.221743
C  -2.891467 -0.748132 0.028599
C  -3.473564 0.662851 0.047707
H  4.784916 0.396909 -0.039014
H  3.39607 -1.387039 0.849267
H  3.377387 -1.368781 -0.930761
H  2.256889 1.642528 -1.317299
H  3.597978 0.863577 -2.210988
H  3.888713 2.368466 -1.289516
H  3.922422 2.339939 1.274849
H  2.289442 1.617691 1.324212
H  3.648006 0.816151 2.169944
H  1.281254 -0.831553 -2.181699
H  1.325122 -0.861268 2.154221
H  -1.212804 -0.786554 -2.157829
H  -1.168757 -0.814657 2.181408
H  -3.302883 -1.273911 0.91127
H  -3.321633 -1.26091 -0.852153
H  -5.249011 1.520211 0.031452
