program: Gaussian 09
title: 000216966
version: EM64L-G09RevD.01
frameworkgroup: C1[X(C11H21N2O4PS)]
method: RPBEPBE
basis: SDD
operation: Freq
keyword: #p
keyword: freq=noraman
keyword: PBEPBE/SDD
title: #p freq=noraman PBEPBE/SDD
converged: YES YES NO NO
title: Mulliken charges:
elementType: S P O O O O N N C C C C C C C C C C C H H H H H H H H H H H H H H H H H H H H H
charge: 0.063360 1.092995 -0.232647 -0.506425 -0.486738 -0.614271 -0.125588 -0.135367 -0.043575 -0.492675 -0.699986 -0.722948 0.193392 0.339093 -0.803980 -0.248982 -0.253085 -0.654545 -0.650150 0.224238 0.227841 0.235992 0.213796 0.208364 0.223366 0.197176 0.205403 0.293893 0.296990 0.312986 0.238131 0.221116 0.231874 0.238085 0.210337 0.220437 0.288092 0.213539 0.244721 0.235745
chargesum: 0.00000
title: Mulliken charges with hydrogens summed into heavy atoms:
elementType: S P O O O O N N C C C C C C C C C C C
charge: 0.063360 1.092995 -0.232647 -0.506425 -0.486738 -0.614271 -0.125588 -0.135367 0.180664 -0.028842 -0.054459 -0.026475 0.193392 0.339093 -0.194005 0.210265 0.216873 0.064320 0.043856
polarizability: 2.17161672e+02 4.05949077e+00 1.87135878e+02 2.83877698e+00 7.27304086e+00 1.69583140e+02
1716.lowfreq: -12.0446 -4.9595 -4.1075 0.0009 0.0012 0.0018 19.3734 22.7937 31.3745
frequency: 19.3241 22.6673 31.3423 33.8207 39.4883 53.7197 67.5779 76.0100 89.5717 98.3747 107.2347 119.7850 139.1318 158.5475 182.2709 195.8086 199.1936 216.3387 236.9309 239.9956 244.8147 249.4962 281.1747 300.2882 322.4582 334.2908 359.6775 390.7361 409.3005 409.7216 422.3529 426.3470 483.2094 610.0326 617.3875 648.3495 660.1356 683.3038 717.4295 764.4384 806.0365 808.1341 811.5546 846.9814 850.4338 858.9165 874.1891 886.7686 903.8350 926.6924 941.2236 961.1019 971.0608 1003.7199 1007.0580 1011.1148 1063.4687 1091.6121 1096.7100 1112.4652 1129.3073 1138.5014 1148.4298 1170.6213 1180.2186 1204.4997 1256.6650 1259.5589 1267.1761 1282.3677 1308.1352 1331.7553 1334.0120 1342.9976 1344.8326 1383.4374 1396.7009 1399.1388 1407.9083 1424.4745 1444.1604 1461.0265 1464.5028 1467.9185 1469.2533 1471.4625 1473.1662 1482.8201 1483.6087 1485.7706 1493.3322 1496.2171 1520.6559 2968.4905 2971.1479 2986.1470 2987.2468 2988.4130 3007.2955 3008.3851 3024.0195 3030.6353 3059.9867 3064.0309 3074.7490 3076.7851 3076.9215 3077.9110 3080.6821 3082.3792 3089.6182 3112.4391 3113.1328 3117.6641
redmass: 3.5212 4.4615 3.2483 3.7138 3.1759 5.4548 3.0539 3.7090 4.1303 3.3296 4.3443 3.1843 3.6962 8.3073 3.2838 1.6529 1.7247 1.6963 1.2684 1.2504 1.5852 5.5321 5.1086 3.0171 4.8246 3.2860 4.4907 3.4231 4.4770 1.9623 3.7082 4.1552 6.3707 6.2295 7.5618 6.5321 7.1634 6.5064 5.9465 5.9062 1.1168 2.9324 1.1238 1.9845 3.5836 4.0848 1.9651 7.3179 5.4168 1.1881 2.3040 1.5229 3.7044 2.6078 10.9537 3.1704 2.5330 2.1570 2.2157 2.1144 2.3361 1.4983 1.4989 1.6910 1.5174 1.5713 1.2900 1.1346 1.1281 1.3013 1.6907 1.6098 1.4560 1.2134 1.2207 1.2073 1.2190 1.2073 1.2004 1.1569 1.1113 1.0416 1.0507 1.0766 1.0506 1.0484 1.0729 1.0605 1.0768 1.0924 5.1410 1.0761 8.7508 1.0361 1.0369 1.0826 1.0365 1.0365 1.0601 1.0597 1.0600 1.0618 1.0990 1.1002 1.1005 1.1059 1.1004 1.1002 1.1006 1.0966 1.1002 1.1040 1.1052 1.1012
irintensity: 1.2620 1.1670 0.8753 1.4583 1.6910 2.6801 0.1897 2.5139 0.2703 1.9897 2.6058 2.1613 4.0418 4.1570 2.3502 3.7131 3.1400 1.9815 0.6658 0.9875 6.7763 2.8941 6.7222 2.9019 16.8794 4.3911 4.3286 0.5427 13.1102 0.9360 2.9077 6.4709 67.4267 35.2766 84.1505 3.5383 93.5816 2.4897 7.6603 11.2667 6.5462 1.1383 12.4606 14.6818 157.7325 129.2944 3.6125 6.5984 25.5106 2.8133 7.6095 0.4002 4.8000 154.1018 83.9032 120.0564 0.9686 11.6477 6.1890 14.4161 7.4182 2.0698 7.5875 19.2717 6.8558 8.5748 2.8352 0.2338 0.6733 3.6829 10.0739 11.2259 0.3480 16.7325 11.0614 13.7101 25.7826 32.7607 16.0784 16.0635 4.4037 12.4185 3.6326 3.6169 5.5599 9.5402 6.2097 9.9150 6.6485 5.2558 62.0633 22.3822 30.1432 18.8784 44.1218 7.6867 27.0674 13.1147 22.4774 24.7330 30.4145 1.4661 10.3434 31.2075 18.8298 5.5762 57.3005 25.8887 23.3374 24.6214 14.0400 12.6000 29.4233 2.1207
temp: 298.150 k
press: 1.00000 atm
elementType: 16 15 8 8 8 8 7 7 6 6 6 6 6 6 6 6 6 6 6 1 1 1 1 1 1 1 1 1 1 1 1 1 1 1 1 1 1 1 1 1
symmnumber: 1
zpe: 833904.0 jmol-1
zpe.correction: 0.317617 hartree
zpe.thermalcorrener: 0.341601 hartree
zpe.thermalcorrenthalpy: 0.342546 hartree
zpe.thermalcorrgfe: 0.260606 hartree
zpe.sumelectzpe: -1579.892599 hartree
zpe.sumelectthermal: -1579.868615 hartree
zpe.sumelectthermalent: -1579.867671 hartree
zpe.sumelectthermalfe: -1579.949610 hartree
dipole: 0.6721 2.5581 -0.3891
dipole: 2.6734
quadrupole: -120.4796 -128.1005 -124.0854
quadrupole: -5.5232 -6.1046 8.0212
quadrupole: 3.7422 -3.8786 0.1364 -5.5232 -6.1046 8.0212
hfenergy: -1580.2102161 hartree
pointgroup: C01 [X(C11H21N2O4P1S1)]
dipole: -0.008502 0.6209495 0.8488798 debye
polarizability: 213.4958402|-5.4833314|186.7355075|-10.1987494|10.475209|173.6493422 unknown
InChI: InChI=1S/C7H11N2OS.C4H10O3P/c1-5(2)3-6-8-9-7(4-11)10-6;1-3-6-8(5)7-4-2/h5H,3-4H2,1-2H3;3-4H2,1-2H3
charge 0 multiplicity 1
40 atoms
S  1.790534 -2.327911 -1.192525
P  2.034974 -0.145132 -0.513129
O  -1.814541 -1.394397 0.464301
O  2.348019 0.856597 -1.883296
O  3.634748 -0.257176 0.109741
O  0.843773 0.353216 0.429635
N  -2.423366 -0.35123 -1.465011
N  -1.271617 -1.185645 -1.734362
C  -3.28868 1.592839 1.179207
C  -3.748555 0.193149 0.647786
C  -4.46926 2.264233 1.917286
C  -2.040389 1.486921 2.085144
C  -2.70848 -0.492532 -0.170255
C  -0.94287 -1.763514 -0.583103
C  0.18421 -2.678636 -0.242148
C  1.213449 1.49745 -2.633569
C  4.417943 0.994623 0.381164
C  0.784463 0.640389 -3.823241
C  3.893709 1.752103 1.603857
H  -3.029784 2.206531 0.292673
H  -4.019212 -0.449836 1.505593
H  -4.647877 0.324677 0.019613
H  -5.357144 2.363163 1.264833
H  -4.762298 1.675385 2.807982
H  -4.187001 3.275373 2.262561
H  -2.245748 0.83757 2.958591
H  -1.762763 2.486691 2.467878
H  -1.164968 1.075715 1.551545
H  -0.036622 -3.726127 -0.514051
H  0.386188 -2.621959 0.837304
H  0.376266 1.685031 -1.934959
H  1.647464 2.461526 -2.949232
H  5.432766 0.59797 0.548021
H  4.412655 1.618452 -0.53069
H  0.063738 1.211988 -4.438742
H  1.653687 0.385943 -4.453752
H  0.282072 -0.282066 -3.488325
H  4.556001 2.612325 1.817208
H  2.872318 2.13626 1.435072
H  3.8743 1.097842 2.491795
