program: Gaussian 09
title: 000216980
version: EM64L-G09RevD.01
frameworkgroup: C1[X(C13H14I3NO4)]
method: RPBEPBE
basis: SDD
operation: Freq
keyword: #p
keyword: freq=noraman
keyword: PBEPBE/SDD
title: #p freq=noraman PBEPBE/SDD
converged: NO YES NO NO
title: Mulliken charges:
elementType: I I I O O O O N C C C C C C C C C C C C C H H H H H H H H H H H H H H
charge: 0.175865 0.155191 0.165190 -0.272286 -0.267924 -0.263187 -0.251691 -0.256662 -0.494273 0.658319 0.207936 -0.503419 -0.627043 -0.627617 -0.524700 0.614957 -0.126253 -0.553532 0.244354 -0.511722 -0.505084 0.278313 0.256561 0.286616 0.258406 0.240392 0.280592 0.243189 0.277716 0.246981 0.241334 0.236523 0.241401 0.235229 0.240328
chargesum: 0.00000
title: Mulliken charges with hydrogens summed into heavy atoms:
elementType: I I I O O O O N C C C C C C C C C C C C C
charge: 0.175865 0.155191 0.165190 -0.272286 -0.267924 -0.263187 -0.251691 -0.256662 0.040601 0.658319 0.207936 0.041603 -0.627043 0.136555 -0.524700 0.614957 0.151463 -0.553532 0.244354 0.213116 0.211874
polarizability: 2.75938871e+02 -1.62909027e+01 2.56044107e+02 4.54068847e+01 7.66464903e+00 1.83585888e+02
1716.lowfreq: -13.7826 -6.5798 -0.0004 -0.0002 -0.0002 4.1405 14.3933 15.9678 25.4291
frequency: 13.5035 15.8314 25.3163 39.7508 46.7914 52.0499 67.9326 78.8973 83.0567 89.6336 94.8411 96.1142 104.7005 111.2407 133.0893 135.3231 140.0192 163.4405 175.8376 180.9864 195.8939 222.0680 236.7345 247.6024 261.3575 300.4680 346.0571 367.5758 402.9282 407.2250 479.1687 487.1473 522.0394 543.4163 565.6772 580.6822 605.9786 637.6272 684.7461 689.7562 725.2135 763.8558 800.4802 811.8324 863.2314 871.0469 920.5699 952.7673 979.9073 1015.0459 1016.9406 1052.3141 1104.0363 1106.8699 1113.6825 1119.7696 1133.5396 1138.6236 1149.2121 1149.4951 1165.4086 1206.3834 1243.5519 1249.8986 1281.9995 1308.0705 1319.8103 1338.8042 1370.4799 1393.1418 1421.5649 1423.3277 1437.4926 1440.2716 1448.8515 1453.5972 1460.4700 1463.0854 1463.9944 1472.5895 1482.5724 1507.1682 1531.3805 1604.3452 1639.1118 2980.6746 2983.6938 2990.2274 3004.0321 3006.2376 3048.1287 3070.8091 3078.7914 3078.9027 3106.0601 3114.4644 3138.0841 3149.5718 3182.2184
redmass: 7.5586 8.3014 5.8718 5.4166 6.9876 5.1185 5.0677 4.9345 8.5726 6.8633 1.2973 2.6837 3.2981 1.1160 1.7651 1.8320 2.9659 83.4730 3.6636 4.6394 5.3830 5.4347 4.9632 7.1249 6.8004 4.7093 6.3505 5.0705 6.7471 6.8196 8.0688 4.1087 3.9559 2.8250 4.7642 4.2902 9.1419 6.0815 6.2274 7.8937 5.5513 8.3586 1.8140 6.3871 5.3310 1.3940 4.8317 5.9893 4.6095 2.8087 5.1397 3.5655 1.2333 3.0577 1.2716 1.3236 2.0223 2.0551 1.4372 1.3710 1.5017 2.3559 2.8427 1.5761 1.9846 9.0057 2.9471 2.5847 2.0785 2.8031 1.3549 1.2008 1.2734 1.0791 1.0961 1.0502 1.0556 1.0526 1.0506 1.0903 1.0504 8.9579 8.3403 8.1116 8.7484 1.0306 1.0337 1.0618 1.0362 1.0573 1.0964 1.1027 1.1019 1.1004 1.1046 1.0993 1.1022 1.1047 1.0932
irintensity: 0.1767 0.1860 0.6015 1.2930 1.2347 0.3521 0.4957 0.3789 1.6729 2.3746 0.1547 3.1023 1.5087 0.0513 1.5129 1.6225 2.1627 0.0319 8.8699 3.2188 1.0093 4.4761 3.8702 0.0808 9.9519 38.7086 1.8918 4.3315 6.9865 2.3740 18.5769 5.5467 14.3663 8.5759 4.4350 15.0813 38.7476 7.3780 11.3621 15.7205 23.4245 8.2050 10.8218 26.2487 7.7799 11.8676 29.0826 35.5620 11.1915 31.2906 14.8950 26.5814 0.1146 17.4972 0.6544 1.8980 195.6071 142.5344 14.4483 3.4344 69.5108 64.4192 12.2808 118.9634 14.2485 4.1492 145.8853 180.3305 21.3601 138.1733 91.0036 32.7890 32.5389 2.4395 51.7264 13.4646 11.6285 13.0536 11.4898 27.8847 15.5052 10.4582 1.7657 297.5033 118.7792 48.0152 51.1443 9.0446 53.1632 5.4623 5.9829 14.0537 9.1850 16.9834 26.5270 0.0594 17.2947 16.6799 0.3277
temp: 298.150 k
press: 1.00000 atm
elementType: 53 53 53 8 8 8 8 7 6 6 6 6 6 6 6 6 6 6 6 6 6 1 1 1 1 1 1 1 1 1 1 1 1 1 1
symmnumber: 1
zpe: 648855.7 jmol-1
zpe.correction: 0.247136 hartree
zpe.thermalcorrener: 0.272184 hartree
zpe.thermalcorrenthalpy: 0.273128 hartree
zpe.thermalcorrgfe: 0.184704 hartree
zpe.sumelectzpe: -892.355440 hartree
zpe.sumelectthermal: -892.330392 hartree
zpe.sumelectthermalent: -892.329448 hartree
zpe.sumelectthermalfe: -892.417872 hartree
dipole: 1.2589 0.0789 2.6439
dipole: 2.9294
quadrupole: -171.1906 -157.8043 -156.9202
quadrupole: 1.8409 -8.4147 -2.9192
quadrupole: -9.2189 4.1674 5.0515 1.8409 -8.4147 -2.9192
hfenergy: -892.6025758 hartree
pointgroup: C01 [X(C13H14I3N1O4)]
dipole: -0.1424276 -0.9643091 -0.6149107 debye
polarizability: 236.8324362|63.170226|233.0271184|19.4365346|-18.3800906|245.7093124 unknown
InChI: InChI=1S/C13H14I3NO4/c1-17(9(18)4-5-10(19)20-2)12-7(14)6-8(15)13(21-3)11(12)16/h6H,4-5H2,1-3H3
charge 0 multiplicity 1
35 atoms
I  -1.100049 0.140088 2.997017
I  -0.846942 2.355546 -2.775399
I  -4.504333 -2.361011 -1.462278
O  -3.158611 -1.816184 1.458639
O  1.948119 2.71027 0.935785
O  4.999312 -0.998279 -0.788947
O  3.205466 -1.987196 0.317202
N  -0.223483 2.030325 0.449254
C  1.65771 0.447813 0.018997
C  -1.148484 1.022143 0.020032
C  1.165319 1.815399 0.500437
C  3.181789 0.440758 -0.181629
C  -1.676706 0.06623 0.935511
C  -0.786751 3.317107 0.918657
C  -1.606762 0.96728 -1.326562
C  -2.610535 -0.927461 0.530827
C  -2.551129 0.008869 -1.748723
C  -3.044411 -0.932246 -0.821631
C  3.744367 -0.967973 -0.176819
C  -2.420628 -3.094645 1.637468
C  5.684589 -2.314268 -0.791193
H  1.389189 -0.316931 0.774822
H  1.138919 0.155606 -0.911758
H  3.656459 1.016139 0.637368
H  3.479504 0.951822 -1.112787
H  -1.356165 3.809387 0.110311
H  0.060598 3.955775 1.213412
H  -1.446226 3.15822 1.790926
H  -2.896149 -0.007235 -2.784254
H  -2.972287 -3.632583 2.42146
H  -1.383303 -2.901506 1.965653
H  -2.426183 -3.678064 0.698869
H  5.851766 -2.659515 0.242936
H  6.637257 -2.132471 -1.307689
H  5.075873 -3.061209 -1.327917
