program: Gaussian 09
title: 000216968
version: EM64L-G09RevD.01
frameworkgroup: C1[X(C13H15I3N2O3)]
method: RPBEPBE
basis: SDD
operation: Freq
keyword: #p
keyword: freq=noraman
keyword: PBEPBE/SDD
title: #p freq=noraman PBEPBE/SDD
converged: YES YES NO NO
title: Mulliken charges:
elementType: I I I O O O N N C C C C C C C C C C C C C H H H H H H H H H H H H H H H
charge: 0.132230 0.152608 0.126746 -0.257611 -0.411121 -0.246676 -0.271880 -0.684877 -0.105466 -0.545346 -0.389900 0.218907 0.185539 -0.696948 0.671313 -0.628409 -0.692396 -0.559720 0.864002 -0.123503 -0.629776 0.255033 0.247789 0.274724 0.217276 0.201477 0.213011 0.233221 0.215776 0.243098 0.280249 0.236624 0.271128 0.370752 0.316182 0.315943
chargesum: 0.00000
title: Mulliken charges with hydrogens summed into heavy atoms:
elementType: I I I O O O N N C C C C C C C C C C C C C
charge: 0.132230 0.152608 0.126746 -0.257611 -0.040369 -0.246676 -0.271880 -0.052751 0.149567 -0.022833 0.028852 0.218907 0.185539 -0.034940 0.671313 0.131562 -0.692396 -0.559720 0.864002 0.147625 -0.629776
polarizability: 3.02347436e+02 -4.23540193e+00 2.64535731e+02 -4.47494569e+01 9.25633978e-01 1.59734302e+02
1716.lowfreq: -2.7404 -0.0006 -0.0005 0.0003 4.8472 8.0126 12.5405 20.4831 24.6121
frequency: 12.4488 20.4037 24.6001 47.9632 57.1593 63.0281 70.2051 76.2472 86.7301 91.8310 99.4464 106.0798 116.2637 134.3020 161.7803 163.7164 176.9204 198.4005 219.8649 253.1315 266.9559 267.4561 280.8699 290.3544 307.1872 349.0518 372.5631 393.0640 411.0658 449.5979 472.1012 487.1610 503.1302 521.1850 528.3690 573.6332 595.5101 610.2449 621.7656 675.3446 680.7540 708.1167 729.9507 745.9529 767.8436 817.4102 859.7343 875.1561 906.1037 961.7836 968.1173 1008.6506 1029.0598 1049.8214 1054.1914 1070.1298 1084.4372 1102.2466 1127.8331 1132.9781 1146.3649 1203.6579 1231.0709 1242.5746 1262.5265 1272.8441 1280.2554 1303.1240 1325.2989 1337.8915 1354.1981 1382.4968 1389.8010 1400.3068 1423.5203 1426.7464 1441.2340 1466.3662 1476.6556 1481.4004 1482.0428 1487.3888 1516.2265 1563.3895 1601.3089 1629.4927 1654.2239 2975.4853 2983.9396 2984.7051 2987.7204 3026.5979 3045.1498 3061.2194 3070.3983 3078.5244 3086.7018 3113.9688 3179.4835 3506.8237 3513.2134 3655.2192
redmass: 8.4182 12.1162 4.7535 8.8949 6.9989 3.2903 5.6841 3.7746 29.5547 4.1369 28.2027 1.6303 3.7625 2.9364 72.2529 2.5774 2.6692 5.2632 1.5016 3.9394 4.5563 3.9027 4.6779 4.4445 6.4433 4.3786 3.3929 4.9141 3.9595 1.1590 6.4340 1.3342 3.2198 2.9944 3.1159 4.2098 1.4261 3.4046 9.3743 7.0134 8.5801 4.0979 3.7545 2.2953 8.8126 1.7600 5.1041 1.3943 1.7818 2.7960 2.3107 10.1149 2.8536 2.3187 2.1765 1.9657 1.9799 2.1990 1.7509 1.5117 2.0504 1.2790 1.4106 2.1885 1.4448 1.2957 2.8473 2.0371 1.4292 7.8441 2.4075 1.7887 3.7697 1.2136 1.1184 1.3515 4.5967 1.0737 1.0419 1.0476 1.0614 1.0958 8.0669 4.7366 7.4529 1.3403 7.9406 1.0587 1.0341 1.0370 1.0606 1.0994 1.0945 1.0918 1.1027 1.0995 1.0999 1.0992 1.0929 1.0637 1.0455 1.1038
irintensity: 0.3461 0.0164 0.2499 1.6447 0.1092 0.6349 1.2868 1.2661 0.1393 0.7407 0.0601 1.2058 1.0672 1.7566 0.0240 0.8920 0.0141 0.6267 1.8858 1.8978 5.7849 6.3645 6.7872 4.4581 2.2991 11.6126 1.1483 5.9285 11.7714 2.5316 4.1750 242.4800 20.7712 17.6880 27.1269 2.7785 105.0748 26.6234 45.1776 16.3171 5.9014 53.5374 18.1391 11.9707 22.8914 1.4618 2.2215 8.8912 8.7755 5.4199 7.4072 36.3337 56.4590 101.5262 131.1249 53.3249 151.3544 11.6668 6.8503 9.5059 55.9439 7.0816 0.6477 41.7475 2.0566 3.4506 14.0709 33.8706 5.1072 37.6700 89.1504 19.5483 91.5900 19.5682 42.4956 47.7337 212.8453 10.2156 10.0949 15.5449 13.7150 20.5612 1.0357 21.8113 284.2606 256.3735 161.1713 28.1307 64.4148 17.4578 16.4034 7.5497 3.8574 6.2975 14.6379 40.8071 42.1004 0.0590 0.0678 24.7069 64.8193 61.7815
temp: 298.150 k
press: 1.00000 atm
elementType: 53 53 53 8 8 8 7 7 6 6 6 6 6 6 6 6 6 6 6 6 6 1 1 1 1 1 1 1 1 1 1 1 1 1 1 1
symmnumber: 1
zpe: 687188.6 jmol-1
zpe.correction: 0.261736 hartree
zpe.thermalcorrener: 0.286075 hartree
zpe.thermalcorrenthalpy: 0.287019 hartree
zpe.thermalcorrgfe: 0.201605 hartree
zpe.sumelectzpe: -872.527024 hartree
zpe.sumelectthermal: -872.502686 hartree
zpe.sumelectthermalent: -872.501742 hartree
zpe.sumelectthermalfe: -872.587155 hartree
dipole: -4.5044 2.8794 1.1388
dipole: 5.4660
quadrupole: -166.9405 -160.5826 -164.5810
quadrupole: -4.1874 1.2906 3.6153
quadrupole: -2.9058 3.4520 -0.5463 -4.1874 1.2906 3.6153
hfenergy: -872.7887604 hartree
pointgroup: C01 [X(C13H15I3N2O3)]
dipole: 1.6725325 -1.1210316 -0.7553865 debye
polarizability: 276.1001202|-68.8792145|193.1309779|18.8068729|22.0919278|257.3863704 unknown
InChI: InChI=1S/C13H15I3N2O3/c1-3-6(13(20)21)4-9(19)18(2)12-8(15)5-7(14)11(17)10(12)16/h5-6,20H,3-4,17H2,1-2H3
charge 0 multiplicity 1
36 atoms
I  1.432921 -0.018524 -3.070799
I  0.710956 1.907015 2.75443
I  5.284932 -1.901778 1.415333
O  -2.044666 1.838943 -0.925011
O  -4.930271 0.265601 -0.239179
O  -3.61328 0.385085 1.665501
N  0.229468 1.570149 -0.506328
N  3.908583 -1.560408 -1.566813
C  -2.760817 -0.819535 -0.320277
C  -1.324761 -0.329032 -0.032907
C  -2.896631 -2.325996 0.064254
C  -1.095408 1.101125 -0.527004
C  -3.757395 0.011278 0.478635
C  -4.25962 -2.952959 -0.295992
C  1.338166 0.76555 -0.077815
C  0.520482 2.960779 -0.92368
C  2.072394 -0.014735 -1.011875
C  1.764697 0.764754 1.279082
C  3.211681 -0.804438 -0.646479
C  2.882512 0.002135 1.680009
C  3.586379 -0.76269 0.735848
H  -3.000394 -0.6915 -1.390063
H  -0.598217 -1.018247 -0.501645
H  -1.141772 -0.355694 1.059811
H  -2.703414 -2.434572 1.149943
H  -2.090595 -2.87632 -0.460873
H  -4.272969 -4.027563 -0.037847
H  -5.089366 -2.463523 0.2435
H  -4.468264 -2.857689 -1.377467
H  0.947359 3.538056 -0.084005
H  -0.434167 3.415496 -1.231524
H  1.225352 2.972079 -1.774291
H  3.19962 0.00548 2.724925
H  -5.537307 0.820843 0.322459
H  4.715828 -2.107523 -1.27345
H  3.626082 -1.571637 -2.545004
