program: Gaussian 09
title: 000211674
version: EM64L-G09RevD.01
frameworkgroup: C1[X(C15H19ClN2S2)]
method: RPBEPBE
basis: SDD
operation: Freq
keyword: #p
keyword: freq=noraman
keyword: PBEPBE/SDD
title: #p freq=noraman PBEPBE/SDD
converged: YES YES NO NO
title: Mulliken charges:
elementType: Cl S S N N C C C C C C C C C C C C C C C H H H H H H H H H H H H H H H H H H H
charge: -0.051917 0.262744 0.071988 -0.050670 -0.078290 0.000040 -0.421983 -0.403674 -0.391301 -0.404243 -0.388711 -0.427734 -0.688356 -0.661941 0.456153 -0.330875 -0.300176 -0.204710 -0.199071 -0.113488 0.193086 0.186054 0.216485 0.228059 0.210264 0.204602 0.194663 0.194002 0.208104 0.204816 0.192853 0.256841 0.256119 0.266738 0.287172 0.241817 0.268992 0.257383 0.258166
chargesum: 0.00000
title: Mulliken charges with hydrogens summed into heavy atoms:
elementType: Cl S S N N C C C C C C C C C C C C C C C
charge: -0.051917 0.262744 0.071988 -0.050670 -0.078290 0.193127 -0.019443 0.034648 0.007963 -0.002136 0.008958 0.085226 -0.134446 -0.661941 0.456153 -0.089058 -0.031185 0.052672 0.059094 -0.113488
polarizability: 2.83573900e+02 -2.52204421e+01 1.97792121e+02 -1.45280538e+01 -1.02017177e+01 1.86289363e+02
1716.lowfreq: -22.4856 -4.5801 -0.0011 0.0009 0.0010 7.6742 16.1556 28.2620 34.4661
frequency: 11.6494 28.1815 33.9232 45.7231 58.6838 85.5374 101.6240 119.8534 159.9505 191.6056 210.8188 224.2065 257.4522 263.0098 284.8828 305.4406 328.5502 350.4143 378.0626 402.1167 405.7689 410.9916 427.6813 444.3129 467.1590 489.3713 505.2784 525.0750 535.9384 564.9086 614.8998 623.0230 673.5370 707.6797 772.7496 779.4893 781.8390 816.6920 821.5889 834.5998 870.0308 876.1191 888.1412 891.9356 914.3735 918.0099 938.9885 957.0941 972.1757 996.1101 1000.5498 1042.0853 1045.2580 1052.5938 1070.6362 1072.2557 1087.1957 1107.4959 1109.1868 1128.0807 1167.9584 1178.9010 1189.8733 1196.7847 1234.8273 1249.7842 1256.5255 1260.0955 1271.4173 1287.1141 1297.5325 1301.9874 1326.8576 1331.3447 1334.7544 1341.7201 1344.4765 1357.1830 1364.2259 1391.0210 1395.6983 1404.2270 1446.1373 1454.2182 1461.0834 1463.2704 1464.4036 1469.9338 1474.6825 1477.5130 1582.7737 1594.8740 2964.0889 2966.4756 2969.2170 2971.2708 2975.3422 2987.0770 2988.4054 3033.2784 3034.0692 3040.9837 3041.2075 3046.3091 3056.4780 3093.4791 3135.0592 3146.0748 3160.5016 3173.5319 3180.1211
redmass: 5.7125 3.9016 3.5346 6.4100 7.8974 7.5930 3.3851 5.5706 7.9330 5.0706 2.1946 3.2922 4.3214 3.5567 8.7343 3.0905 2.7823 5.6754 3.0009 5.6411 5.0950 2.9642 4.3673 2.5653 5.9092 2.1617 2.4758 3.9147 8.4392 3.2220 6.0287 7.0395 6.9993 3.8545 2.5794 1.4768 3.9203 1.2602 1.5825 2.6877 1.7127 1.5961 1.6770 3.0068 2.6079 2.2942 1.4328 1.3668 3.4363 4.0197 2.5269 2.1420 1.9703 1.2636 1.3965 2.6133 2.0509 1.3408 2.4109 2.2778 2.4622 1.1398 1.5037 1.7773 1.4737 1.2894 1.3253 1.2772 1.4893 1.5635 1.6694 1.2794 1.4027 1.4419 1.3905 1.4671 1.5036 1.6819 3.9837 2.2513 1.8045 2.0985 1.1054 1.0927 1.1288 1.1027 1.0880 1.0860 2.3143 1.0989 7.7071 6.4332 1.0683 1.0653 1.0663 1.0604 1.0747 1.0651 1.0651 1.0969 1.0953 1.0705 1.0876 1.1014 1.1020 1.1004 1.1089 1.0895 1.0889 1.0962 1.0979
irintensity: 0.1946 0.4096 0.3443 0.7350 1.0402 1.0412 0.2901 1.3299 1.9293 2.2198 0.8151 1.4000 1.9485 1.4727 0.8399 1.4555 1.4111 6.6632 1.4436 7.3738 0.9231 0.4931 14.2282 2.3414 10.3000 6.3940 11.4911 16.2698 19.9424 1.5179 31.9642 2.3051 25.7770 9.8978 13.4577 3.1606 47.8515 6.6281 36.0756 8.5937 1.9332 8.5190 20.2827 3.1968 0.9647 5.8220 9.2677 2.4252 93.8116 49.9505 6.8806 42.4931 10.5677 25.2006 3.1570 38.4081 149.3949 10.1016 0.0934 6.7046 5.7763 10.7845 17.3901 65.4389 19.7285 57.2858 1.0533 15.5356 11.5187 63.8472 107.4105 3.7847 1.8992 16.5431 3.1811 0.7043 16.3955 26.8620 6.0748 37.1025 7.1884 63.9722 18.6530 5.8306 23.3855 10.1743 9.8225 16.5825 169.0489 3.1812 0.8557 0.5634 26.4085 8.3134 30.6550 34.7581 17.5729 34.8710 29.7765 62.0183 68.9978 8.8615 43.5503 40.8377 66.8505 10.4272 7.5748 7.2727 3.3636 3.8072 1.2544
temp: 298.150 k
press: 1.00000 atm
elementType: 17 16 16 7 7 6 6 6 6 6 6 6 6 6 6 6 6 6 6 6 1 1 1 1 1 1 1 1 1 1 1 1 1 1 1 1 1 1 1
symmnumber: 1
zpe: 821348.6 jmol-1
zpe.correction: 0.312835 hartree
zpe.thermalcorrener: 0.332181 hartree
zpe.thermalcorrenthalpy: 0.333125 hartree
zpe.thermalcorrgfe: 0.262067 hartree
zpe.sumelectzpe: -1947.174631 hartree
zpe.sumelectthermal: -1947.155285 hartree
zpe.sumelectthermalent: -1947.154340 hartree
zpe.sumelectthermalfe: -1947.225399 hartree
dipole: -3.7296 -4.1529 3.5565
dipole: 6.6185
quadrupole: -142.6408 -156.8806 -134.9054
quadrupole: 2.7862 1.7663 11.1367
quadrupole: 2.1681 -12.0716 9.9035 2.7862 1.7663 11.1367
hfenergy: -1947.4874659 hartree
pointgroup: C01 [X(C15H19Cl1N2S2)]
dipole: 1.9188729 0.6840039 1.6218639 debye
polarizability: 258.6445825|-49.1972406|218.1688566|5.280286|12.8493022|190.8419455 unknown
InChI: InChI=1S/C15H19ClN2S2/c16-12-6-8-14(9-7-12)18-10-17(11-20-15(18)19)13-4-2-1-3-5-13/h6-9,13H,1-5,10-11H2
charge 0 multiplicity 1
39 atoms
Cl -4.734707 3.541438 0.678874
S  0.850948 -2.952015 -1.031156
S  -1.722229 -1.908208 -2.150557
N  1.735072 -1.111465 0.979719
N  -0.606446 -0.885842 0.146703
C  2.452538 0.098894 0.467704
C  3.901976 0.134061 1.014569
C  2.443576 0.266056 -1.077756
C  4.635454 1.428855 0.588285
C  3.176436 1.565022 -1.496294
C  4.622263 1.605772 -0.94806
C  0.341842 -0.989051 1.342516
C  2.05704 -2.409775 0.467236
C  -0.560409 -1.781459 -0.911139
C  -1.626802 0.13725 0.232018
C  -2.451336 0.20152 1.38112
C  -1.760884 1.116169 -0.784178
C  -3.399051 1.240111 1.526734
C  -2.708312 2.15099 -0.652562
C  -3.512509 2.19973 0.505145
H  1.908401 0.964359 0.901303
H  4.463048 -0.74219 0.627718
H  3.875142 0.040851 2.116237
H  1.404924 0.272492 -1.4549
H  2.946437 -0.603067 -1.546675
H  5.675184 1.411319 0.967135
H  4.139022 2.302126 1.060106
H  2.616355 2.443431 -1.11258
H  3.180038 1.648434 -2.599804
H  5.110707 2.558827 -1.227656
H  5.21421 0.792107 -1.415886
H  0.17289 -0.080629 1.940546
H  0.050484 -1.878431 1.934856
H  3.069622 -2.454806 0.043846
H  1.908329 -3.200312 1.218757
H  -2.377962 -0.570709 2.154226
H  -1.136936 1.058827 -1.680094
H  -4.041238 1.288793 2.410451
H  -2.818318 2.906128 -1.43591
