program: Gaussian 09
title: 000216926
version: EM64L-G09RevD.01
frameworkgroup: C1[X(C14H9N3O5)]
method: RPBEPBE
basis: SDD
operation: Freq
keyword: #p
keyword: freq=noraman
keyword: PBEPBE/SDD
title: #p freq=noraman PBEPBE/SDD
converged: YES YES NO NO
title: Mulliken charges:
elementType: O O O O O N N N C C C C C C C C C C C C C C H H H H H H H H H
charge: -0.237456 -0.234888 -0.237463 -0.193646 -0.200490 -0.423593 -0.053569 0.022159 0.321177 0.085731 0.330276 -0.408272 0.277524 0.146445 -0.470565 -0.343824 0.368415 -0.187334 -0.356110 -0.353890 -0.255396 -0.164831 0.321649 0.345967 0.267870 0.288070 0.250120 0.294482 0.277723 0.258390 0.265329
chargesum: 0.00000
title: Mulliken charges with hydrogens summed into heavy atoms:
elementType: O O O O O N N N C C C C C C C C C C C C C C
charge: -0.237456 -0.234888 -0.237463 -0.193646 -0.200490 -0.077626 -0.053569 0.022159 0.321177 0.085731 0.330276 -0.086623 0.277524 0.146445 -0.202695 -0.055753 0.368415 0.062786 -0.061628 -0.076167 0.002994 0.100497
polarizability: 3.71296053e+02 -1.96598147e+00 2.00392881e+02 -4.78393870e+00 -1.76549394e+00 7.56954970e+01
1716.lowfreq: -8.4360 -1.8713 -0.0001 0.0005 0.0010 4.0399 12.3157 28.7346 40.0035
frequency: 11.6494 28.6875 39.9908 44.3677 60.8064 81.7617 96.9631 107.8892 153.6663 162.0417 185.6927 216.9259 264.5665 299.8456 330.6476 350.7890 363.4642 385.3110 417.3062 432.0589 461.8800 482.2965 534.6083 583.9565 600.5009 609.3063 640.5341 642.8878 660.1747 677.4170 695.2271 701.3202 735.0842 738.5326 743.9379 799.7772 826.3565 829.6164 834.9715 851.1317 862.6759 870.6709 890.8470 894.0437 926.9094 928.2575 961.6007 971.9778 988.6794 1007.5196 1017.0758 1042.2967 1059.1971 1077.0921 1090.7130 1113.4570 1139.0268 1175.2000 1182.0113 1192.5362 1210.6452 1216.6794 1266.7206 1294.5107 1342.7640 1376.9855 1382.4644 1396.3279 1404.6409 1432.1378 1471.0677 1488.2695 1506.7467 1572.3127 1603.6409 1612.8365 1616.2913 1625.1733 3156.0368 3156.3273 3172.6726 3189.0902 3225.4978 3241.7364 3270.8390 3289.0249 3540.9225
redmass: 7.9875 6.2306 7.1121 6.5873 11.1416 8.7901 6.8704 5.2566 6.0765 6.6674 5.1229 8.4892 5.2586 6.4156 11.1578 9.3332 8.5492 8.1274 3.2681 8.0335 5.7575 6.3753 5.9195 3.6041 5.3986 1.3221 6.2434 5.4095 5.3026 8.5190 2.5890 3.7608 1.2652 6.7177 7.3149 9.6961 10.9791 1.3095 1.4453 1.3950 6.1839 6.5801 1.3844 7.9567 3.0180 2.0864 3.8924 1.3852 6.0028 1.6917 1.3704 2.3022 2.3359 2.1174 1.8516 2.5707 1.6459 1.1503 3.2397 2.7026 2.8402 2.5585 3.8392 1.3152 3.3252 10.2211 4.7484 6.7886 5.9567 3.3395 2.6403 4.6624 2.3438 6.5910 5.9336 7.4348 8.3454 9.2726 1.0909 1.0888 1.0942 1.0975 1.0918 1.0999 1.1082 1.1000 1.0764
irintensity: 0.4410 1.4864 0.1759 0.1202 1.3487 3.9295 17.4295 0.6143 0.0417 10.0335 0.5930 2.6086 0.4943 5.1534 3.5116 0.3424 2.7437 0.3876 0.2198 1.2788 9.8092 0.5675 0.9390 12.1323 0.7363 61.6802 6.0112 5.5530 8.3916 30.4767 63.3790 6.2188 85.7782 12.6954 10.6726 31.1429 22.3967 44.4787 26.7774 38.4850 29.5347 3.7611 0.2784 14.1438 6.8358 15.4324 8.0631 1.1307 1.4548 37.5731 2.3087 9.3681 4.9474 36.6503 21.3539 36.5767 8.8949 35.6945 4.5730 39.8923 159.2780 127.6801 145.2227 0.1784 2.3187 111.8245 1.5711 0.9276 32.8841 8.6241 109.2391 44.5454 537.0212 27.8977 99.7685 139.7434 35.5750 97.9406 5.0424 4.8329 6.8750 2.8902 4.7551 0.7571 0.0030 10.3033 35.4301
temp: 298.150 k
press: 1.00000 atm
elementType: 8 8 8 8 8 7 7 7 6 6 6 6 6 6 6 6 6 6 6 6 6 6 1 1 1 1 1 1 1 1 1
symmnumber: 1
zpe: 557089.5 jmol-1
zpe.correction: 0.212184 hartree
zpe.thermalcorrener: 0.230259 hartree
zpe.thermalcorrenthalpy: 0.231203 hartree
zpe.thermalcorrgfe: 0.162180 hartree
zpe.sumelectzpe: -1077.593289 hartree
zpe.sumelectthermal: -1077.575214 hartree
zpe.sumelectthermalent: -1077.574270 hartree
zpe.sumelectthermalfe: -1077.643293 hartree
dipole: 1.1661 4.0841 0.5393
dipole: 4.2814
quadrupole: -112.2836 -130.9172 -127.9676
quadrupole: -15.9790 -5.4730 0.3819
quadrupole: 11.4392 -7.1944 -4.2447 -15.9790 -5.4730 0.3819
hfenergy: -1077.8054727 hartree
pointgroup: C01 [X(C14H9N3O5)]
dipole: -0.4340312 -0.4912613 -1.5516353 debye
polarizability: 368.7049591|-26.959249|82.1547912|7.5528634|21.5082524|196.5246811 unknown
InChI: InChI=1S/C14H9N3O5/c18-14(9-3-1-4-10(7-9)17(19)20)15-13-8-11(16-22-13)12-5-2-6-21-12/h1-8,15H
charge 0 multiplicity 1
31 atoms
O  -1.635616 0.0167 2.002463
O  -5.042004 0.325738 -1.145616
O  0.191796 -0.364854 -1.785769
O  6.598148 -0.146354 1.549153
O  4.696862 0.405716 2.682359
N  0.174265 -0.237418 0.540282
N  -3.101216 0.189316 1.993584
N  5.319629 -0.004412 1.628527
C  2.328035 -0.494913 -0.638118
C  -3.417273 0.188932 0.663244
C  -1.201555 -0.072591 0.674489
C  -2.270563 0.027564 -0.19749
C  -4.798297 0.340031 0.248338
C  0.829391 -0.358702 -0.69281
C  3.107599 -0.184945 0.501103
C  2.973384 -0.934537 -1.825114
C  4.506571 -0.337763 0.426663
C  4.37463 -1.081488 -1.872796
C  5.161681 -0.785443 -0.739573
C  -6.00098 0.503335 0.926279
C  -7.04145 0.594595 -0.069972
C  -6.427217 0.484563 -1.30818
H  -2.248726 -0.010591 -1.279987
H  0.69956 -0.305077 1.415029
H  2.691384 0.201427 1.437302
H  2.348007 -1.146691 -2.698092
H  4.855791 -1.425433 -2.793249
H  6.250138 -0.885603 -0.742194
H  -6.114406 0.550212 2.007122
H  -8.106372 0.72559 0.10995
H  -6.780295 0.494897 -2.335329
