program: Gaussian 09
title: 000216945
version: EM64L-G09RevD.01
frameworkgroup: C1[X(C10H24N6S2)]
method: RPBEPBE
basis: SDD
operation: Freq
keyword: #p
keyword: freq=noraman
keyword: PBEPBE/SDD
title: #p freq=noraman PBEPBE/SDD
converged: YES YES NO NO
title: Mulliken charges:
elementType: S S N N N N N N C C C C C C C C C C H H H H H H H H H H H H H H H H H H H H H H H H
charge: -0.012802 -0.012188 -0.377965 -0.377938 -0.104820 -0.104656 -0.672013 -0.672008 -0.420293 -0.420307 -0.640422 -0.640534 -0.311975 -0.311893 0.247963 0.247921 -0.695908 -0.696087 0.212470 0.223451 0.212519 0.223432 0.257890 0.285961 0.285967 0.257806 0.238696 0.214265 0.238566 0.214366 0.277330 0.277373 0.219996 0.225214 0.201022 0.225200 0.220036 0.201058 0.333577 0.298057 0.333551 0.298125
chargesum: 0.00000
title: Mulliken charges with hydrogens summed into heavy atoms:
elementType: S S N N N N N N C C C C C C C C C C
charge: -0.012802 -0.012188 -0.100635 -0.100565 -0.104820 -0.104656 -0.040380 -0.040332 0.015628 0.015644 -0.096571 -0.096762 0.140986 0.141039 0.247963 0.247921 -0.049677 -0.049793
polarizability: 2.85294139e+02 6.04794947e-02 1.91348416e+02 1.83403226e+01 -3.86665505e-02 1.38394748e+02
1716.lowfreq: -18.9389 -7.4154 -6.1429 -0.0024 -0.0007 0.0006 4.3734 6.9312 11.9441
frequency: 3.4960 4.9564 11.6996 23.0864 27.5213 39.9657 42.1587 70.1274 72.8836 101.7472 126.5418 144.7049 146.6912 160.0110 166.3033 193.7607 219.0771 246.3945 251.6255 271.8639 274.9312 328.9870 329.4726 338.2975 338.6551 346.7137 350.4409 403.2517 444.7938 445.2924 483.1588 487.5422 507.6596 509.1200 517.0262 519.2064 575.4445 576.2824 624.3978 624.5942 662.8865 663.0774 776.9606 777.4560 791.5470 791.9770 882.0202 883.7117 927.4230 928.8581 968.6697 969.8605 1013.6909 1014.8501 1040.7299 1041.2786 1075.8799 1076.2589 1121.6363 1122.2707 1140.6798 1141.3322 1166.9974 1167.8245 1171.1860 1172.1593 1235.6963 1240.8782 1249.5896 1253.1819 1279.5178 1285.3417 1309.0869 1310.1049 1341.2144 1342.0818 1360.7943 1360.9853 1389.1398 1389.2503 1399.5288 1401.0451 1465.0665 1465.6824 1471.0562 1471.3887 1477.3953 1477.6265 1486.2352 1487.2350 1497.3688 1497.4142 1588.7633 1590.8646 1633.7736 1639.3550 2910.3276 2910.5214 2957.2799 2957.4166 2974.8441 2974.9403 2975.3902 2975.4618 3013.6155 3015.5420 3051.3479 3051.4074 3076.6480 3076.6764 3089.3076 3089.3253 3091.3110 3093.1509 3500.4312 3501.9986 3533.7874 3533.8344 3661.7768 3662.7635
redmass: 3.2234 4.1657 4.4619 4.1133 3.2121 3.6177 2.7502 4.7172 4.2055 5.3109 4.6232 2.5870 3.5767 2.8937 4.2038 2.1318 2.4933 1.9627 2.3923 1.9467 2.1919 2.1567 2.1915 2.2460 2.0749 1.3596 1.5345 13.1652 2.2365 2.2358 2.6833 2.6108 1.3743 1.3498 1.1862 1.1296 5.3845 5.0575 3.2744 3.2728 5.3753 5.2983 2.1692 2.1225 1.2831 1.3117 1.9588 1.9458 1.8896 1.9261 2.1144 2.2476 2.3929 2.3149 2.0324 2.0610 1.8480 1.8495 2.1315 2.0938 1.8301 1.8635 1.4373 1.5809 2.0404 1.8553 1.2510 1.1837 1.1781 1.2174 1.1977 1.2152 1.5624 1.5383 1.2922 1.2927 1.6167 1.6141 1.2406 1.2407 1.0912 1.0906 1.0909 1.0941 1.1815 1.1551 1.0882 1.0801 1.6746 1.7575 1.0821 1.0813 1.1875 1.2227 5.4036 4.8148 1.0627 1.0627 1.0710 1.0710 1.0930 1.0913 1.0388 1.0397 1.0591 1.0591 1.0923 1.0923 1.0958 1.0957 1.1003 1.1003 1.1064 1.1058 1.0455 1.0453 1.0760 1.0760 1.1040 1.1041
irintensity: 0.0467 0.2673 0.0142 0.1438 0.3149 2.0385 0.0878 0.0390 1.3979 0.3125 39.3927 0.0647 3.2817 6.2860 3.2072 0.0437 11.0938 5.3418 3.7458 5.0262 8.8459 1.6738 12.6703 13.2303 34.4466 234.3460 82.2637 0.7009 98.2745 12.6657 12.3839 1.3212 27.6838 47.6065 66.2789 218.2606 2.9582 13.6171 4.9532 14.6729 1.6197 19.5432 0.6481 6.6796 2.6460 5.7421 1.1629 28.3248 13.0191 5.6935 5.3409 6.7268 1.8259 6.2360 0.0600 9.6574 7.2111 0.0283 5.8864 6.7510 18.4605 1.4314 6.4588 0.5545 65.2040 0.9370 18.0183 2.8682 88.8765 0.5841 3.6415 0.4178 154.8127 2.9152 91.0557 57.2785 33.7856 4.6235 32.0294 24.3342 19.2825 12.4119 23.1786 8.0063 146.5056 11.0203 131.0275 0.0733 362.7306 11.5289 4.4016 21.0899 111.9290 0.6460 163.9434 695.3950 95.9965 42.6414 54.3102 46.9823 22.2561 41.4815 48.4046 22.0638 60.1330 11.7073 2.8436 2.8843 57.7502 51.3043 43.9246 40.7258 19.9028 9.2341 186.3070 29.5343 6.0897 6.6394 105.9896 50.0691
temp: 298.150 k
press: 1.00000 atm
elementType: 16 16 7 7 7 7 7 7 6 6 6 6 6 6 6 6 6 6 1 1 1 1 1 1 1 1 1 1 1 1 1 1 1 1 1 1 1 1 1 1 1 1
symmnumber: 1
zpe: 926608.7 jmol-1
zpe.correction: 0.352927 hartree
zpe.thermalcorrener: 0.377082 hartree
zpe.thermalcorrenthalpy: 0.378027 hartree
zpe.thermalcorrgfe: 0.290980 hartree
zpe.sumelectzpe: -1518.617034 hartree
zpe.sumelectthermal: -1518.592879 hartree
zpe.sumelectthermalent: -1518.591935 hartree
zpe.sumelectthermalfe: -1518.678981 hartree
dipole: 0.0023 -3.2719 -0.0002
dipole: 3.2719
quadrupole: -120.5024 -109.0389 -128.6191
quadrupole: 0.0155 2.3781 -0.0162
quadrupole: -1.1156 10.3479 -9.2323 0.0155 2.3781 -0.0162
hfenergy: -1518.9699611 hartree
pointgroup: C01 [X(C10H24N6S2)]
dipole: 0.0036273 1.2872339 0.0068009 debye
polarizability: 278.8542673|-0.0619332|191.3473043|-35.2260899|0.2904057|144.8357308 unknown
InChI: InChI=1S/C10H24N6S2/c1-3-13-9(11)15-5-7-17-18-8-6-16-10(12)14-4-2/h13-14H,3-8,11-12H2,1-2H3
charge 0 multiplicity 1
42 atoms
S  -0.569625 -0.563668 0.983139
S  0.568828 -0.561111 -0.997261
N  -5.20925 1.336262 0.611609
N  5.213697 1.321195 -0.60013
N  -4.038955 -0.689024 0.365456
N  4.035311 -0.701426 -0.372303
N  -3.066942 1.436399 -0.332721
N  3.070883 1.422085 0.342709
C  -3.00506 -1.488889 -0.306972
C  2.997834 -1.503137 0.29225
C  -1.861831 -1.923378 0.630248
C  1.855584 -1.927597 -0.65063
C  -6.417774 0.645934 1.090082
C  6.419973 0.629942 -1.082971
C  -4.070313 0.62154 0.219177
C  4.071478 0.607748 -0.21502
C  -7.625668 1.599531 1.086245
C  7.630818 1.579744 -1.07317
H  -2.565068 -1.007966 -1.212105
H  -3.491084 -2.427804 -0.646803
H  2.557048 -1.027719 1.199884
H  3.480469 -2.445898 0.626243
H  -1.307065 -2.790634 0.232451
H  -2.262411 -2.171568 1.630249
H  2.257719 -2.170256 -1.651374
H  1.297085 -2.795739 -0.260048
H  -6.58727 -0.219057 0.426564
H  -6.259385 0.224532 2.105456
H  6.586898 -0.239736 -0.424932
H  6.260181 0.215441 -2.10095
H  -5.058523 2.290276 0.946572
H  5.067044 2.278404 -0.927715
H  -8.529689 1.072995 1.440837
H  -7.822192 1.982578 0.068881
H  -7.462186 2.466095 1.756525
H  7.828565 1.955828 -0.053442
H  8.533196 1.052639 -1.43106
H  7.469967 2.450946 -1.738043
H  -2.096115 1.131332 -0.268472
H  -3.295797 2.315179 -0.791269
H  2.098854 1.121942 0.274768
H  3.303073 2.295544 0.809643
