program: Gaussian 09
title: 000216978
version: EM64L-G09RevD.01
frameworkgroup: C1[X(C14H16I3NO4)]
method: RPBEPBE
basis: SDD
operation: Freq
keyword: #p
keyword: freq=noraman
keyword: PBEPBE/SDD
title: #p freq=noraman PBEPBE/SDD
converged: NO YES NO NO
title: Mulliken charges:
elementType: I I I O O O O N C C C C C C C C C C C C C C H H H H H H H H H H H H H H H H
charge: 0.168391 0.148643 0.159526 -0.273981 -0.267368 -0.415190 -0.240155 -0.245724 0.627197 -0.345360 0.204688 -0.509094 -0.640532 -0.535333 -0.482649 -0.665926 0.629969 -0.100128 -0.556527 0.185139 -0.268114 -0.660633 0.222524 0.261638 0.285414 0.258120 0.295125 0.260076 0.220565 0.258473 0.216774 0.277378 0.235266 0.213152 0.226324 0.228853 0.247696 0.375784
chargesum: 0.00000
title: Mulliken charges with hydrogens summed into heavy atoms:
elementType: I I I O O O O N C C C C C C C C C C C C C C
charge: 0.168391 0.148643 0.159526 -0.273981 -0.267368 -0.039406 -0.240155 -0.245724 0.627197 0.138803 0.204688 0.034440 -0.640532 -0.535333 0.072552 0.029886 0.629969 0.177250 -0.556527 0.185139 0.180304 0.042240
polarizability: 3.08299246e+02 6.38121746e+00 2.66325416e+02 3.37640513e+01 -3.60556722e+00 1.82773180e+02
1716.lowfreq: -18.6365 -5.5959 -2.3093 -0.0006 0.0002 0.0002 10.5444 13.8531 16.9583
frequency: -10.0286 13.3560 14.9646 21.4102 28.7541 35.3750 46.3071 64.5965 80.2344 82.7991 87.4413 91.1789 95.9135 119.6100 123.0220 153.5161 160.6784 164.7739 180.8237 196.7044 225.0470 226.1867 249.9405 262.3996 290.4181 303.8874 335.2239 345.5199 397.1809 425.6936 451.0914 475.9489 482.7154 515.3159 522.5068 558.6555 576.9092 590.3169 609.8867 646.9069 669.6802 679.6606 711.4941 748.9764 773.3853 782.8216 797.6706 805.3912 867.3582 873.9770 895.7309 918.9906 987.6721 1010.7805 1014.3178 1023.0685 1045.6364 1071.2561 1085.7156 1087.1153 1105.8968 1145.4129 1147.9741 1161.0636 1205.2011 1232.0654 1239.0743 1250.0694 1261.0576 1272.2626 1295.1996 1304.6626 1326.3575 1347.1320 1363.6127 1366.8512 1381.8081 1386.9500 1393.3056 1404.7783 1441.5217 1446.2119 1451.6319 1461.5354 1464.8803 1467.1313 1480.7951 1482.1286 1500.9164 1528.0412 1594.7757 1663.3502 2988.5010 2990.0068 2991.2884 2997.5336 3012.6681 3012.8531 3057.1424 3073.2608 3075.3243 3076.5906 3086.1928 3096.6854 3113.4013 3117.2539 3181.8285 3512.7305
redmass: 3.0804 10.0683 2.4202 6.8411 8.8491 4.9528 6.5704 6.7667 4.7379 12.5984 4.5426 7.4253 6.3724 4.2143 3.3234 3.2410 5.3180 21.4069 3.1351 3.3335 2.7055 1.8128 2.1851 2.7529 4.4038 4.9295 3.6450 3.8002 6.3905 3.9702 4.3082 5.3642 3.7041 2.3925 3.2510 3.9461 6.8337 4.6906 5.0842 1.4923 4.5875 6.3438 5.7508 4.4016 1.7150 2.2320 1.7492 1.4738 3.7190 1.3882 3.6252 2.9164 2.7711 2.8791 4.3786 3.2760 3.1061 2.8142 2.1866 2.0222 2.5296 1.9801 1.6128 1.2139 2.2809 1.5380 2.9594 1.7620 1.5224 1.1536 2.4974 7.7896 1.6127 1.4108 1.3703 1.9142 2.0890 1.2566 1.2257 3.2564 1.0863 1.1139 1.0969 1.0403 1.0483 1.1009 1.0557 1.1168 6.5721 8.2569 7.6130 8.0725 1.0369 1.0645 1.0366 1.0648 1.0635 1.0598 1.0931 1.1036 1.0993 1.0963 1.0974 1.0983 1.1025 1.1031 1.0930 1.0639
irintensity: 0.1539 0.1219 0.0827 0.0788 0.9930 0.8019 0.4056 1.4454 0.2571 0.7872 0.1753 1.2990 0.2851 3.4526 0.9264 2.3732 4.1668 0.5608 0.3197 1.6191 1.2009 1.2203 1.7315 1.5407 1.1179 8.0099 0.3708 10.3393 1.4725 8.9739 31.8979 11.3384 6.0038 63.0194 4.5830 30.4129 16.6109 31.0654 32.8315 103.1297 6.9201 7.7226 30.9646 6.5571 26.3856 11.1355 9.2467 4.0736 7.4338 10.6861 8.3919 3.8404 16.4664 39.0823 117.1806 64.2629 74.9212 170.9337 17.7429 8.6992 28.3223 21.9150 12.5862 1.4663 96.7750 4.6397 23.3087 213.3655 0.8683 7.7316 71.3386 10.7391 124.9256 45.1071 33.8582 80.9475 49.6344 13.1286 26.9068 207.9120 8.8538 25.6140 48.3471 14.1020 9.3635 4.2307 14.5062 18.4133 7.0749 5.7574 259.6331 168.0892 12.9008 2.6887 29.7185 40.1646 39.9654 14.3311 7.3206 1.6998 27.5424 6.9025 33.3970 17.7821 22.1848 30.3475 0.2652 23.8074
temp: 298.150 k
press: 1.00000 atm
elementType: 53 53 53 8 8 8 8 7 6 6 6 6 6 6 6 6 6 6 6 6 6 6 1 1 1 1 1 1 1 1 1 1 1 1 1 1 1 1
symmnumber: 1
zpe: 724104.5 jmol-1
zpe.correction: 0.275797 hartree
zpe.thermalcorrener: 0.300706 hartree
zpe.thermalcorrenthalpy: 0.301650 hartree
zpe.thermalcorrgfe: 0.213470 hartree
zpe.sumelectzpe: -931.592746 hartree
zpe.sumelectthermal: -931.567838 hartree
zpe.sumelectthermalent: -931.566894 hartree
zpe.sumelectthermalfe: -931.655073 hartree
dipole: 3.8601 -0.9916 -2.2140
dipole: 4.5591
quadrupole: -169.6236 -167.3586 -170.4814
quadrupole: 8.5210 -10.1015 -7.0138
quadrupole: -0.4691 1.7960 -1.3269 8.5210 -10.1015 -7.0138
hfenergy: -931.8685433 hartree
pointgroup: C01 [X(C14H16I3N1O4)]
dipole: -1.6972535 -0.506957 -0.2821848 debye
polarizability: 278.586057|-61.8835285|216.8008108|14.8540778|14.2861351|262.0109739 unknown
InChI: InChI=1S/C14H16I3NO4/c1-3-18(10(19)5-6-11(20)21)13-8(15)7-9(16)14(12(13)17)22-4-2/h7,20H,3-6H2,1-2H3
charge 0 multiplicity 1
38 atoms
I  -0.68335 1.131161 2.548372
I  0.724469 -2.118983 -2.539539
I  -3.867626 1.840941 -2.684587
O  -2.985775 2.069977 0.537899
O  3.001494 -1.20167 1.339011
O  5.623037 2.259557 -1.300419
O  3.697491 3.239324 -0.455126
N  0.795628 -1.076851 0.641941
C  -0.260102 -0.439572 -0.090877
C  0.441809 -2.180273 1.592929
C  2.122402 -0.618933 0.635415
C  2.430467 0.632737 -0.190745
C  -1.11971 0.505722 0.545719
C  -0.518899 -0.74358 -1.457654
C  3.942055 0.773275 -0.433186
C  0.746295 -3.594366 1.063419
C  -2.222333 1.111777 -0.125683
C  -1.567881 -0.117814 -2.162807
C  -2.405511 0.804423 -1.50319
C  4.349507 2.202385 -0.713351
C  -4.40051 1.725452 0.905393
C  -4.486801 0.653266 1.994399
H  -0.630913 -2.074509 1.833411
H  1.022115 -2.004246 2.515611
H  2.068304 1.515623 0.374158
H  1.876811 0.630889 -1.145172
H  4.482972 0.425047 0.469791
H  4.292182 0.127073 -1.256451
H  0.143436 -3.844414 0.173986
H  1.814711 -3.686605 0.808294
H  0.517299 -4.332501 1.854922
H  -1.722232 -0.335272 -3.221391
H  -4.797833 2.692976 1.250799
H  -4.950514 1.418504 -0.003483
H  -5.55047 0.473006 2.239527
H  -4.053392 -0.304841 1.655668
H  -3.962911 0.97027 2.910524
H  5.877476 3.213644 -1.430327
