program: Gaussian 09
title: 000216912
version: EM64L-G09RevD.01
frameworkgroup: C1[X(C14H10N2OS)]
method: RPBEPBE
basis: SDD
operation: Freq
keyword: #p
keyword: freq=noraman
keyword: PBEPBE/SDD
title: #p freq=noraman PBEPBE/SDD
converged: NO NO NO NO
title: Mulliken charges:
elementType: S O N N C C C C C C C C C C C C C C H H H H H H H H H H
charge: 0.300920 -0.233002 -0.062057 -0.063371 0.305192 -0.240833 -0.483806 0.208809 0.432004 -0.265122 -0.330528 -0.358199 -0.367300 -0.142924 -0.518252 -0.232789 -0.220089 -0.225218 0.269859 0.247358 0.252515 0.234687 0.276847 0.247655 0.267017 0.233803 0.232673 0.234152
chargesum: 0.00000
title: Mulliken charges with hydrogens summed into heavy atoms:
elementType: S O N N C C C C C C C C C C C C C C
charge: 0.300920 -0.233002 -0.062057 -0.063371 0.305192 -0.240833 -0.213947 0.208809 0.432004 -0.017764 -0.078012 -0.123513 -0.090453 0.104731 -0.251235 0.001014 0.012583 0.008934
polarizability: 4.55581544e+02 -1.24115037e+01 1.76990749e+02 9.64361401e-02 -5.53083032e-02 6.89616370e+01
1716.lowfreq: 0.0015 0.0019 0.0022 2.9773 7.7341 24.8172 32.5125 36.0650 47.0360
frequency: 32.1930 35.9715 47.0345 65.9756 96.9987 115.2674 151.0815 171.5018 233.4486 256.9351 282.2319 363.7168 379.6118 397.5753 406.4228 481.5367 493.5016 499.6145 567.9484 586.0367 614.2980 621.4667 641.9404 682.2702 688.2034 697.7322 706.2302 730.7240 775.4562 802.8208 826.8227 833.9889 843.3367 844.3855 858.8311 883.6008 896.2257 911.9743 935.8802 987.4266 987.5936 993.7447 1010.1072 1010.5528 1021.1947 1063.1210 1078.9606 1093.0655 1130.4910 1173.7316 1180.8275 1189.3395 1220.6702 1248.0560 1304.0287 1315.2307 1355.7355 1367.0740 1394.2484 1422.6046 1441.1666 1476.1184 1481.4019 1561.3358 1575.0206 1587.5656 1593.2438 1621.0430 3014.8007 3120.2248 3131.4952 3145.1628 3159.0775 3168.2479 3169.4333 3186.6965 3231.6777 3252.0083
redmass: 6.5030 4.9773 6.1217 6.4222 4.7019 6.2058 5.8456 7.0110 7.9792 2.6662 5.8014 8.6256 7.3752 6.8395 2.8355 5.1142 3.2879 6.9128 3.2462 6.2221 6.5033 9.8883 8.3195 3.1300 7.0943 1.7573 1.1691 8.2439 1.7209 5.5238 7.8419 1.3346 1.5642 4.7471 1.2505 9.1615 9.4938 1.3760 1.3718 1.5167 6.2454 1.4681 2.5616 1.3610 2.1479 1.7469 1.6703 1.1241 5.5365 1.0727 1.1176 1.8476 1.5404 2.1334 2.4587 1.5755 1.7113 4.5642 5.9712 5.0154 2.3831 4.1391 2.7809 6.1740 7.6760 6.9851 5.8957 7.0886 1.0885 1.0879 1.0872 1.0920 1.0961 1.0902 1.1005 1.0968 1.1006 1.0992
irintensity: 2.0077 0.4132 0.6509 1.2016 0.0564 0.2971 0.4425 1.4241 2.8564 15.1001 1.7819 4.7111 0.4536 2.9910 0.2659 0.4232 16.8245 11.0998 0.3277 20.6612 0.3220 11.2139 0.1163 1.6620 1.5003 45.7850 116.6623 1.7386 40.5841 69.8909 13.9032 15.8876 52.6932 2.6027 0.3749 13.2216 19.5398 0.5293 0.2225 14.7289 1.7806 6.9522 3.1977 2.8374 5.9228 16.4347 17.1001 0.6005 25.5347 4.3585 13.9967 37.3009 19.9859 35.4450 1.2038 12.3375 2.8978 9.1057 14.4437 49.9530 21.5697 40.1901 12.5485 86.3019 31.4796 250.2368 5.6370 41.3222 18.9101 5.4321 0.0286 19.0872 24.0179 10.3311 30.0355 4.8102 0.5585 2.1954
temp: 298.150 k
press: 1.00000 atm
elementType: 16 8 7 7 6 6 6 6 6 6 6 6 6 6 6 6 6 6 1 1 1 1 1 1 1 1 1 1
symmnumber: 1
zpe: 531885.5 jmol-1
zpe.correction: 0.202585 hartree
zpe.thermalcorrener: 0.217457 hartree
zpe.thermalcorrenthalpy: 0.218401 hartree
zpe.thermalcorrgfe: 0.158280 hartree
zpe.sumelectzpe: -1120.970972 hartree
zpe.sumelectthermal: -1120.956100 hartree
zpe.sumelectthermalent: -1120.955156 hartree
zpe.sumelectthermalfe: -1121.015276 hartree
dipole: 2.0808 2.6249 0.0097
dipole: 3.3496
quadrupole: -74.1447 -104.4353 -117.9833
quadrupole: -10.2779 0.0294 -0.0163
quadrupole: 24.7097 -5.5809 -19.1289 -10.2779 0.0294 -0.0163
hfenergy: -1121.1735564 hartree
pointgroup: C01 [X(C14H10N2O1S1)]
dipole: -0.8030587 -1.039236 -0.1085897 debye
polarizability: 455.8702073|-8.4721204|175.5691646|2.0160921|10.8854048|70.0945585 unknown
InChI: InChI=1S/C14H10N2OS/c1-2-5-11(6-3-1)10-15-14-9-12(16-17-14)13-7-4-8-18-13/h1-10H
charge 0 multiplicity 1
28 atoms
S  5.156323 1.182757 0.269575
O  0.623628 1.461442 0.253637
N  2.072845 1.517442 0.272231
N  -1.106739 -0.267881 0.062093
C  2.479032 0.214904 0.142238
C  3.894118 -0.112388 0.12214
C  1.364562 -0.690209 0.039126
C  0.217174 0.088071 0.109161
C  -3.490861 0.208906 0.095852
C  4.485858 -1.368598 -0.002529
C  -2.086483 0.61522 0.146162
C  -4.505438 1.203369 0.193038
C  -3.865915 -1.159457 -0.045775
C  5.923883 -1.339876 0.015191
C  6.443414 -0.060622 0.153567
C  -5.867348 0.840353 0.15065
C  -5.225653 -1.517836 -0.087613
C  -6.230532 -0.520494 0.010548
H  1.392763 -1.770385 -0.07118
H  3.904594 -2.289013 -0.104443
H  -1.884293 1.696947 0.259848
H  -4.218675 2.257084 0.30233
H  -3.071317 -1.908809 -0.119011
H  6.549206 -2.231604 -0.071284
H  7.485567 0.253347 0.196852
H  -6.642733 1.610312 0.226365
H  -5.511538 -2.569949 -0.19646
H  -7.288642 -0.804033 -0.022313
