program: Gaussian 09
title: 000216915
version: EM64L-G09RevD.01
frameworkgroup: C1[X(C12H7N3O3S2)]
method: RPBEPBE
basis: SDD
operation: Freq
keyword: #p
keyword: freq=noraman
keyword: PBEPBE/SDD
title: #p freq=noraman PBEPBE/SDD
converged: NO NO NO NO
title: Mulliken charges:
elementType: S S O O O N N N C C C C C C C C C C C C H H H H H H H
charge: 0.309463 0.405109 -0.230153 -0.193076 -0.204343 -0.057579 -0.057112 0.085023 0.306522 -0.241035 0.589144 -0.471865 0.215425 -0.306016 -0.262988 -0.129630 -0.317676 -0.711072 -0.140953 -0.516370 0.274975 0.328996 0.249460 0.261445 0.293456 0.250680 0.270168
chargesum: 0.00000
title: Mulliken charges with hydrogens summed into heavy atoms:
elementType: S S O O O N N N C C C C C C C C C C C C
charge: 0.309463 0.405109 -0.230153 -0.193076 -0.204343 -0.057579 -0.057112 0.085023 0.306522 -0.241035 0.589144 -0.196890 0.215425 0.022981 -0.013528 -0.129630 -0.056231 -0.417616 0.109726 -0.246202
polarizability: 4.72389637e+02 -2.68202359e+01 2.07661512e+02 -1.35821746e-02 -3.53745801e-03 7.09823062e+01
1716.lowfreq: -17.6664 -6.0513 -5.9663 -0.0026 -0.0016 0.0020 9.7476 21.7417 29.2752
frequency: 4.9371 21.1427 29.2623 48.8685 65.2143 86.4753 99.8162 145.2221 152.3350 167.5754 179.2786 239.0803 282.3815 304.6739 359.4395 373.2491 375.1008 397.1343 436.3870 452.0014 480.0866 506.6286 565.8722 602.4989 604.1295 624.6476 653.7579 677.0296 678.4877 683.6214 692.7469 705.5262 723.1238 768.6692 774.7996 807.4040 816.4980 833.3823 833.5198 846.1165 882.7475 898.6955 912.3328 929.8727 964.7574 975.4353 1009.8198 1035.7981 1063.4238 1092.5708 1128.1867 1178.4957 1183.0691 1192.6197 1222.3489 1228.6660 1305.0175 1341.6614 1365.2827 1367.7575 1413.1580 1420.6495 1460.2333 1481.3390 1532.0348 1575.6994 1585.3289 1601.5659 3033.8661 3174.8029 3193.8016 3216.1135 3222.9157 3243.6437 3261.4954
redmass: 7.3599 10.7263 8.7371 9.9106 8.2262 9.1525 6.5350 8.3588 6.5076 4.8033 12.8489 10.2816 4.6892 3.8766 12.7971 10.0427 7.9908 7.7669 5.8417 12.7288 5.7313 6.7479 3.2222 8.4947 3.3466 10.0821 5.7240 7.4116 8.9991 2.9670 7.0400 1.1709 10.3075 6.4645 1.4272 5.3631 4.9960 8.1096 1.3281 1.5816 9.2124 9.4036 1.3811 1.4016 3.4805 1.6228 2.5351 4.6357 1.7290 1.1254 3.8781 2.0735 1.3737 1.8647 1.4836 10.1857 2.8642 1.6057 4.3694 13.7041 4.5318 7.0974 7.5057 5.7091 7.4850 6.8468 7.5676 8.1949 1.0894 1.0908 1.0971 1.0958 1.0955 1.1002 1.0993
irintensity: 3.3310 0.5303 0.8339 4.2364 0.0046 1.4568 0.2930 1.2082 0.9541 0.5959 0.9370 3.3299 9.8772 6.3646 1.1001 2.2833 2.0751 5.8322 0.5196 6.6016 3.2986 3.0862 1.0475 26.4675 17.4344 16.2090 7.5367 6.9879 4.7136 0.4611 1.3780 109.9574 20.9090 0.5196 30.1344 61.0568 10.4026 19.9130 17.4546 46.3524 11.9756 21.0326 0.4695 16.6049 5.7862 28.3419 3.2869 30.3709 18.1610 2.3311 34.6015 28.6723 42.5030 93.0963 5.7575 352.7092 3.2253 10.0251 5.9527 93.8111 5.5395 37.4502 39.5943 56.9109 76.1324 127.8835 62.6788 77.8700 16.5860 8.2092 4.2328 12.2266 1.7542 0.4356 2.2294
temp: 298.150 k
press: 1.00000 atm
elementType: 16 16 8 8 8 7 7 7 6 6 6 6 6 6 6 6 6 6 6 6 1 1 1 1 1 1 1
symmnumber: 1
zpe: 447363.4 jmol-1
zpe.correction: 0.170392 hartree
zpe.thermalcorrener: 0.187854 hartree
zpe.thermalcorrenthalpy: 0.188798 hartree
zpe.thermalcorrgfe: 0.119626 hartree
zpe.sumelectzpe: -1645.953580 hartree
zpe.sumelectthermal: -1645.936118 hartree
zpe.sumelectthermalent: -1645.935174 hartree
zpe.sumelectthermalfe: -1646.004346 hartree
dipole: -3.1456 -1.2035 0.0050
dipole: 3.3680
quadrupole: -139.1808 -126.9832 -131.8650
quadrupole: -36.4994 0.0131 0.0069
quadrupole: -6.5044 5.6931 0.8113 -36.4994 0.0131 0.0069
hfenergy: -1646.1239716 hartree
pointgroup: C01[X(C12H7N3O3S2)]
dipole: 1.2385704 0.4707107 0.0134192 debye
polarizability: 472.2376168|-27.41662|207.7833231|3.4649981|-0.0396216|71.0125152 unknown
InChI: InChI=1S/C12H7N3O3S2/c16-15(17)12-4-8(7-20-12)6-13-11-5-9(14-18-11)10-2-1-3-19-10/h1-7H
charge 0 multiplicity 1
27 atoms
S  5.957579 0.838431 0.140344
S  -5.354986 1.382879 0.043108
O  1.504082 1.709919 0.101567
O  -5.088714 -2.607218 0.037786
O  -6.868601 -1.161317 0.024864
N  -0.434699 0.219454 0.083318
N  2.950742 1.573107 0.113939
N  -5.600834 -1.423156 0.037465
C  3.184028 0.2230 0.114556
C  4.542218 -0.288714 0.125963
C  -2.720855 0.973256 0.064766
C  1.957001 -0.53137 0.103094
C  0.928574 0.39976 0.095196
C  -3.310475 -0.345283 0.058061
C  4.964104 -1.616313 0.127913
C  -4.690932 -0.299426 0.046532
C  -1.283824 1.228675 0.077262
C  -3.683551 1.991151 0.057994
C  6.393489 -1.770322 0.140642
C  7.071995 -0.561633 0.148476
H  1.837888 -1.610145 0.100964
H  -2.722108 -1.263697 0.061795
H  4.271589 -2.461325 0.120446
H  -0.957667 2.284042 0.081243
H  -3.51437 3.067737 0.060853
H  6.896366 -2.739367 0.14384
H  8.14466 -0.379526 0.158411
