program: Gaussian 09
title: 000216938
version: EM64L-G09RevD.01
frameworkgroup: C1[X(C12H14Cl2NO6P)]
method: RPBEPBE
basis: SDD
operation: Freq
keyword: #p
keyword: freq=noraman
keyword: PBEPBE/SDD
title: #p freq=noraman PBEPBE/SDD
converged: YES YES NO NO
title: Mulliken charges:
elementType: Cl Cl P O O O O O O N C C C C C C C C C C C C H H H H H H H H H H H H H H
charge: 0.069095 0.052802 1.393682 -0.519799 -0.530057 -0.504019 -0.569675 -0.203159 -0.207758 0.025978 0.315755 0.532354 -0.307297 -0.323482 -0.237297 -0.209966 0.381885 -0.361362 -0.352029 -0.638387 -0.660326 -0.569598 0.255998 0.272149 0.236827 0.230523 0.246803 0.212242 0.289651 0.290290 0.228985 0.248838 0.215071 0.242431 0.239973 0.212882
chargesum: 0.00000
title: Mulliken charges with hydrogens summed into heavy atoms:
elementType: Cl Cl P O O O O O O N C C C C C C C C C C C C
charge: 0.069095 0.052802 1.393682 -0.519799 -0.530057 -0.504019 -0.569675 -0.203159 -0.207758 0.025978 0.315755 0.532354 -0.051298 -0.051334 0.230053 0.249079 0.381885 -0.071711 -0.061739 0.054508 0.034959 -0.569598
polarizability: 3.08067900e+02 -2.75583342e+01 2.18278242e+02 9.77498785e+00 2.51723240e+01 1.41121111e+02
1716.lowfreq: -8.6586 -0.0021 -0.0017 -0.0008 1.8622 7.3874 12.1634 22.9547 30.9602
frequency: 11.1646 22.8085 30.9060 38.1691 39.3800 52.2884 57.8789 60.0243 69.6869 73.4887 94.6645 101.2481 119.3906 156.5878 168.6874 178.7279 194.7453 224.6155 239.1458 241.5134 242.6499 265.8480 283.7029 302.0095 328.5603 339.4772 361.4578 387.7281 402.3167 410.8279 433.3782 456.2823 472.1202 484.9610 509.3814 579.7020 619.5688 642.9650 651.6370 663.5726 672.1647 700.3431 747.8030 764.3867 802.9825 803.6276 810.7209 853.2539 867.8067 871.1845 880.4527 887.5458 992.6611 997.9182 1003.1990 1004.9099 1011.1375 1041.0776 1070.8246 1093.2315 1097.2020 1105.8120 1114.5825 1127.1293 1148.1575 1183.8066 1219.1152 1247.6996 1250.7297 1264.4858 1299.0384 1350.0754 1351.5823 1361.3315 1393.5486 1394.9891 1396.0914 1414.0774 1455.0095 1459.5502 1473.9468 1476.0195 1476.4277 1486.6829 1487.4826 1587.1309 1601.8072 1607.0810 2992.4308 2996.3744 3003.6186 3012.4642 3075.9281 3083.9857 3088.6816 3093.9099 3114.9374 3116.4382 3161.3521 3171.2667 3185.1686 3190.9843
redmass: 4.8962 4.6518 4.0833 5.7649 5.0687 5.8584 9.8077 2.6693 6.2970 3.2484 6.5814 2.9414 9.8037 4.6684 6.2620 5.0847 5.1379 5.2640 2.8895 2.0500 1.3894 7.3284 3.7998 12.5997 8.1911 6.0975 6.4380 10.1216 5.0734 2.9703 8.0624 6.3855 5.9591 7.7458 7.5023 6.9169 7.2929 7.1043 9.0111 9.6619 4.2722 6.0184 5.3139 8.5294 1.1035 1.1534 5.9506 1.2706 2.5076 3.5683 4.6287 3.7426 1.3655 1.5838 2.5261 2.5810 2.5626 5.6687 10.5039 3.1290 2.2297 2.3728 1.3195 1.4043 1.5418 1.4104 4.4764 1.2637 3.6042 1.1236 1.2821 1.2583 1.2245 6.6600 1.2354 2.3952 2.0358 4.0311 1.0396 1.0403 1.0679 1.4283 1.5283 1.0756 1.0647 8.2261 9.7190 6.7580 1.0364 1.0373 1.0588 1.0616 1.1049 1.1042 1.0974 1.0977 1.1027 1.1035 1.0893 1.0894 1.0959 1.0972
irintensity: 0.6161 0.5005 0.6847 0.1765 1.3581 0.8559 0.0126 6.3736 1.3376 0.6282 2.2602 0.9004 3.0407 2.3098 1.5123 0.6499 3.1268 0.7550 2.1008 3.1637 1.6067 0.1410 14.0968 6.5018 16.7730 7.9205 13.1444 1.7401 32.5137 0.9057 25.4418 18.3627 3.3216 56.5617 16.8484 5.2643 1.1556 79.5086 52.6957 57.5521 29.6636 74.0666 9.6060 80.1286 11.4778 4.1287 2.6068 1.5518 19.8297 132.4998 221.5225 259.3673 3.1434 8.8560 99.2549 73.8577 86.1043 68.8977 90.0321 17.5401 13.1524 30.3265 9.8509 5.8226 13.3096 98.4628 367.2655 3.3462 19.0316 0.5381 0.1959 2.5902 11.1616 67.5283 35.1874 15.0713 43.0564 48.2267 10.8835 9.7546 3.0407 0.6681 3.0353 11.8285 10.6437 9.2526 78.2874 17.3467 15.3128 13.8925 24.1332 25.2605 8.8729 5.2592 23.1198 23.7027 34.8648 33.4384 3.0313 0.8243 1.0180 2.9388
temp: 298.150 k
press: 1.00000 atm
elementType: 17 17 15 8 8 8 8 8 8 7 6 6 6 6 6 6 6 6 6 6 6 6 1 1 1 1 1 1 1 1 1 1 1 1 1 1
symmnumber: 1
zpe: 657997.7 jmol-1
zpe.correction: 0.250618 hartree
zpe.thermalcorrener: 0.275342 hartree
zpe.thermalcorrenthalpy: 0.276286 hartree
zpe.thermalcorrgfe: 0.191093 hartree
zpe.sumelectzpe: -2231.328204 hartree
zpe.sumelectthermal: -2231.303481 hartree
zpe.sumelectthermalent: -2231.302536 hartree
zpe.sumelectthermalfe: -2231.387729 hartree
dipole: -5.3999 -1.4465 -3.2973
dipole: 6.4903
quadrupole: -170.0299 -139.0850 -155.7885
quadrupole: 8.4788 5.9747 6.6197
quadrupole: -15.0621 15.8828 -0.8207 8.4788 5.9747 6.6197
hfenergy: -2231.5788222 hartree
pointgroup: C01 [X(C12H14Cl2N1O6P1)]
dipole: 2.3124707 0.4553984 -0.9825385 debye
polarizability: 243.09334|-17.9624331|137.8254349|-39.5971893|27.0396061|286.548478 unknown
InChI: InChI=1S/C12H14Cl2NO6P/c1-3-19-22(18,20-4-2)21-11(12(13)14)9-5-7-10(8-6-9)15(16)17/h5-8H,3-4H2,1-2H3
charge 0 multiplicity 1
36 atoms
Cl 0.673562 -0.325516 -4.391715
Cl -2.046498 0.687415 -3.59371
P  1.734486 -1.973096 -0.937442
O  1.290188 -0.303033 -1.467993
O  3.411052 -1.914137 -1.267813
O  1.737693 -1.949705 0.766577
O  0.820498 -3.086076 -1.586216
O  -4.410198 0.630429 3.050641
O  -2.595835 1.64951 3.987624
N  -3.183162 1.030586 3.017229
C  -0.91058 0.264497 -0.542976
C  -0.067895 -0.004582 -1.735353
C  -0.321336 0.953309 0.554528
C  -2.255038 -0.185541 -0.440231
C  3.911885 -1.958052 -2.685002
C  2.766547 -1.173664 1.540441
C  -2.397038 0.763723 1.787733
C  -1.06032 1.214224 1.720201
C  -3.00385 0.061273 0.724415
C  4.3779 -0.568489 -3.112515
C  2.347772 -1.289221 3.000995
C  -0.445021 0.079265 -3.04663
H  0.715304 1.293334 0.472447
H  -2.705483 -0.751345 -1.25949
H  4.741169 -2.683551 -2.645991
H  3.117867 -2.355171 -3.344837
H  3.754386 -1.624142 1.343496
H  2.768628 -0.125453 1.186079
H  -0.632386 1.756781 2.566929
H  -4.035072 -0.285365 0.828053
H  5.151784 -0.188219 -2.424159
H  3.533364 0.140094 -3.129071
H  4.813948 -0.620754 -4.128089
H  2.31471 -2.346565 3.312223
H  1.350535 -0.846508 3.162392
H  3.078337 -0.759356 3.64023
