program: Gaussian 09
title: 000216902
version: EM64L-G09RevD.01
frameworkgroup: C1[X(C9H7ClN2O2S)]
method: RPBEPBE
basis: SDD
operation: Freq
keyword: #p
keyword: freq=noraman
keyword: PBEPBE/SDD
title: #p freq=noraman PBEPBE/SDD
converged: YES YES NO NO
title: Mulliken charges:
elementType: Cl S O O N N C C C C C C C C C H H H H H H H
charge: -0.054819 0.307436 -0.226773 -0.227814 -0.387570 -0.060405 0.284409 -0.234446 -0.428147 0.326374 -0.266274 -0.141018 0.261413 -0.518494 -0.664676 0.301597 0.251922 0.352840 0.249495 0.268662 0.303151 0.303135
chargesum: 0.00000
title: Mulliken charges with hydrogens summed into heavy atoms:
elementType: Cl S O O N N C C C C C C C C C
charge: -0.054819 0.307436 -0.226773 -0.227814 -0.034730 -0.060405 0.284409 -0.234446 -0.126550 0.326374 -0.014352 0.108477 0.261413 -0.249831 -0.058390
polarizability: 2.50126260e+02 -8.18834787e+00 1.46961632e+02 -1.05271888e-01 -8.71087402e-02 5.86263236e+01
1716.lowfreq: -2.8141 -0.0024 -0.0024 -0.0016 3.3287 6.3491 28.5635 33.4625 59.0054
frequency: 28.4658 33.2828 59.0053 72.0683 91.6948 121.7907 123.0375 158.7892 253.0945 312.9039 319.4419 351.0378 382.2439 432.8237 479.9121 516.4867 549.1271 567.6134 623.9983 631.4904 686.4043 691.1772 694.6430 706.3623 717.2716 781.5093 808.5951 824.3028 835.4812 841.5342 880.0502 906.8913 913.4383 936.0297 965.8438 1002.5356 1062.5612 1092.2609 1154.6646 1174.4964 1192.4167 1222.3403 1246.0583 1263.4361 1318.2882 1382.3063 1418.3487 1420.3932 1476.2065 1515.6031 1574.6898 1599.4628 1624.2523 3068.6840 3148.9862 3172.6358 3190.4833 3237.1549 3277.6232 3462.6828
redmass: 10.0731 7.1247 8.6136 3.0576 6.6657 5.1161 10.7017 13.1085 4.9678 10.9809 9.0076 7.8509 10.9881 7.5704 5.7962 6.4363 3.5750 3.1886 10.0605 6.5175 2.6797 7.1492 6.5452 1.1695 1.3197 6.3855 5.9004 8.5537 1.4013 1.3597 8.4527 1.7304 1.3810 7.0573 5.0758 2.6395 1.7152 1.1086 1.1094 2.6115 2.2244 1.4833 3.4720 1.2436 2.5237 6.0571 3.0099 1.3412 5.6618 2.2319 7.7300 7.0593 10.2377 1.0567 1.1089 1.0904 1.0973 1.1004 1.0998 1.0770
irintensity: 0.0027 0.0153 0.5429 11.7474 13.6843 0.2002 0.4469 8.5973 0.0117 11.6435 0.4007 0.0726 2.6604 5.1423 4.0571 22.5481 0.1562 0.4837 6.5589 0.8476 11.6012 9.8441 69.7895 97.5687 91.3404 10.4037 46.4155 29.2334 1.5858 66.4443 7.1932 12.7555 0.8760 1.0565 3.2202 3.0322 12.3518 1.3649 0.4455 23.1649 4.0827 10.0223 30.5508 24.0894 1.9373 1.1534 22.7181 42.8777 56.2749 589.6335 15.5695 271.6347 183.9275 2.4594 0.2627 6.5782 3.3472 0.4455 5.2020 143.0353
temp: 298.150 k
press: 1.00000 atm
elementType: 17 16 8 8 7 7 6 6 6 6 6 6 6 6 6 1 1 1 1 1 1 1
symmnumber: 1
zpe: 386372.4 jmol-1
zpe.correction: 0.147161 hartree
zpe.thermalcorrener: 0.160900 hartree
zpe.thermalcorrenthalpy: 0.161844 hartree
zpe.thermalcorrgfe: 0.103653 hartree
zpe.sumelectzpe: -1464.109437 hartree
zpe.sumelectthermal: -1464.095698 hartree
zpe.sumelectthermalent: -1464.094754 hartree
zpe.sumelectthermalfe: -1464.152945 hartree
dipole: 0.8418 2.6359 0.0006
dipole: 2.7670
quadrupole: -78.5921 -106.4229 -103.0692
quadrupole: -3.8934 -0.0195 -0.0591
quadrupole: 17.4360 -10.3948 -7.0411 -3.8934 -0.0195 -0.0591
hfenergy: -1464.2565982 hartree
pointgroup: C01 [X(C9H7Cl1N2O2S1)]
dipole: -0.4066068 -0.9289518 0.3960057 debye
dipolederiv: -0.4814008 0.1193546 -0.0203406 0.3265454 -0.4121543 0.0804239 -0.1019292 0.096837 -0.1735848 0.0670685 0.0076225 0.0035545 -0.075388 -0.1596037 0.1267215 0.0350665 0.1210638 0.1057307 -0.8810908 0.33691 -0.0743801 0.0722334 -0.3371117 0.0768281 0.0317113 0.054776 -0.1530737 -0.5862526 0.2918874 -0.0954197 -0.5145489 -0.8040864 0.2259334 0.2247946 0.1627555 -0.4173018 -1.7370829 -0.2332528 0.2085624 -0.5947512 -0.5859091 0.1748906 0.3530744 0.1469734 -0.348717 0.0403784 -0.247253 0.0805716 -0.020925 -0.1628497 -0.0030404 -0.0103296 0.015691 -0.1795071 1.108206 -0.233885 0.015049 -0.1458282 0.1137796 0.0113383 -0.0202832 0.0186945 0.111441 -0.0515358 0.2639365 -0.1084883 0.4020385 0.0884938 -0.119201 -0.1594942 -0.1103733 -0.091086 -0.8284531 0.1259852 -0.0023861 0.2073041 -0.1461028 -0.0452624 -0.0350981 -0.0385056 -0.2011128 1.5118515 -0.0477623 -0.0862492 -0.1748422 0.3596571 -0.0628716 -0.0368702 -0.0728619 0.1955282 0.1461023 0.0108615 -0.0249353 -0.1768628 -0.1253214 0.0066891 0.0477519 -0.0072126 -0.1429824 -0.2551289 -0.103267 0.0478039 -0.1856318 -0.065675 -0.0188449 0.0785839 -0.0244694 -0.1459274 1.2660457 -0.0649601 -0.0587991 1.3063357 1.0171747 -0.4224184 -0.6032104 -0.3145779 0.3832797 -0.2148547 -0.0628756 0.0175251 0.1209785 0.1852156 -0.1988095 -0.0538511 -0.1855043 -0.231613 0.1155056 -0.170164 0.0696464 -0.5170845 0.562218 -0.1256252 0.2068466 -0.1533818 0.1847206 0.1726065 -0.0089138 0.0070334 -0.0151548 0.08739 0.052092 0.0088759 0.0516436 0.1952873 0.0465773 -0.0753949 0.0395754 -0.1074491 0.0571291 0.0598622 0.0521347 0.0574766 0.166065 0.4191929 -0.0462526 0.0101746 -0.1060321 0.2328776 0.0427188 0.0337031 0.0379973 0.3023242 0.06688 0.049671 -0.0095395 0.0959551 -0.0126957 0.0739509 -0.0273513 0.0773957 0.1696627 -0.0011254 -0.001273 0.0167048 0.0218847 0.1053992 0.0422335 0.008336 0.0438635 0.201579 0.045349 0.0569151 0.0046021 0.0687323 0.0329867 0.0492941 0.0437605 0.0379317 -0.0041627 0.0311615 0.0321102 -0.0402653 0.0124909 -0.0308115 -0.0269031 -0.0762222 -0.0162128 0.0734502 unknown
polarizability: 247.3626511|-19.5829357|137.7041505|-6.8478114|-29.406711|70.6474139 unknown
InChI: InChI=1S/C9H7ClN2O2S/c10-5-8(13)11-9-4-6(12-14-9)7-2-1-3-15-7/h1-4,11H,5H2
charge 0 multiplicity 1
22 atoms
Cl -5.399201 1.459182 -0.143015
S  3.903251 0.858471 -0.620823
O  -0.552902 1.849331 -0.679948
O  -2.74747 -1.479712 0.807645
N  -2.494059 0.679257 -0.06847
N  0.911474 1.676557 -0.726967
C  1.115205 0.414142 -0.24476
C  2.460873 -0.123252 -0.13691
C  -0.116531 -0.253422 0.113614
C  -1.105032 0.669144 -0.172652
C  2.846472 -1.382331 0.320536
C  4.268535 -1.596343 0.299062
C  -3.241343 -0.384947 0.412964
C  4.977885 -0.502298 -0.174855
C  -4.759604 -0.211922 0.467096
H  -0.257529 -1.249263 0.518036
H  2.131475 -2.134866 0.662355
H  -2.991453 1.528152 -0.365714
H  4.744728 -2.52467 0.622171
H  6.053327 -0.386549 -0.298656
H  -5.102585 -0.313261 1.507191
H  -5.238217 -0.975199 -0.1637
