program: Gaussian 09
title: 000216894
version: EM64L-G09RevD.01
frameworkgroup: C1[X(C11H9BrN2O2)]
method: RPBEPBE
basis: SDD
operation: Freq
keyword: #p
keyword: freq=noraman
keyword: PBEPBE/SDD
title: #p freq=noraman PBEPBE/SDD
converged: YES YES NO NO
title: Mulliken charges:
elementType: Br O O N N C C C C C C C C C C C H H H H H H H H H
charge: 0.001120 -0.226925 -0.225493 -0.386305 -0.069502 0.349530 0.100068 -0.432512 0.318633 -0.351406 -0.351316 -0.244336 -0.230126 -0.233204 0.269134 -0.755002 0.298428 0.228199 0.270806 0.344081 0.230348 0.231396 0.232440 0.316023 0.315923
chargesum: 0.00000
title: Mulliken charges with hydrogens summed into heavy atoms:
elementType: Br O O N N C C C C C C C C C C C
charge: 0.001120 -0.226925 -0.225493 -0.042224 -0.069502 0.349530 0.100068 -0.134085 0.318633 -0.123208 -0.080510 -0.013988 0.001271 -0.000764 0.269134 -0.123057
polarizability: 2.71067585e+02 7.42870529e+00 1.57063252e+02 4.93902681e-02 -1.17412145e-01 6.19808424e+01
1716.lowfreq: -2.3451 -0.0003 0.0004 0.0008 3.8242 12.1224 23.6693 25.0596 53.2541
frequency: 23.5572 24.4485 53.2535 63.0510 87.8178 97.3951 115.9970 171.2418 242.9313 293.4227 328.7731 346.2122 348.6510 400.1056 452.0121 490.9101 508.5012 548.0784 615.1977 632.3309 649.1042 671.8734 678.8655 697.5286 707.0107 782.1546 782.6318 826.9287 843.4033 858.2734 870.3401 922.7294 935.2949 935.6607 970.0956 985.3289 990.1876 1004.2616 1024.2412 1055.2536 1087.8997 1146.8237 1175.3525 1188.0986 1189.8978 1197.3887 1233.9392 1253.1258 1311.8993 1364.7406 1389.4819 1413.4803 1423.7247 1450.0072 1510.4625 1512.0432 1586.9556 1595.1655 1617.4407 1623.3000 3066.3474 3129.2241 3137.8178 3146.7444 3149.6245 3159.8443 3170.6255 3278.1581 3461.4911
redmass: 9.0649 4.1004 8.6886 3.1210 6.6127 12.5159 4.8228 6.4815 4.4665 10.1826 9.4677 8.5337 6.6766 2.7982 5.9925 3.8934 6.2147 3.3132 6.4507 6.2958 5.6260 6.6502 2.0810 1.8392 1.4231 6.4320 1.8368 11.5443 1.4401 1.2750 1.7230 8.0176 1.4428 7.4341 4.7519 1.3844 6.1804 1.3304 2.5816 1.8891 1.6914 1.1273 1.0645 1.9268 2.5284 1.2653 1.3236 2.6387 1.6890 2.8030 9.2853 1.1001 2.9697 2.5847 3.2226 2.4052 6.4126 7.1735 6.1371 9.1977 1.0567 1.0849 1.0882 1.1084 1.0930 1.0965 1.1014 1.0993 1.0771
irintensity: 0.0167 0.4419 0.3010 9.7067 13.6174 1.6132 0.1120 8.8860 0.0758 0.7803 2.9047 4.9127 0.0641 0.0276 9.8425 5.7361 11.9831 0.5749 0.0024 5.4113 88.3369 30.6288 0.8792 60.7804 82.4942 10.2018 60.4730 34.5502 29.9764 7.5869 21.8092 4.6542 5.1431 2.5523 5.4815 0.0884 0.4016 0.3430 5.8564 2.5327 10.2550 0.1242 0.0159 5.6429 14.4019 0.9090 24.0658 57.9310 1.4146 0.1656 1.8608 34.7180 93.5725 6.5465 47.4166 602.2067 72.5042 188.3242 20.8207 156.8765 1.6787 1.3418 4.5420 0.0340 26.7184 18.8617 18.3465 4.6380 149.0859
temp: 298.150 k
press: 1.00000 atm
elementType: 35 8 8 7 7 6 6 6 6 6 6 6 6 6 6 6 1 1 1 1 1 1 1 1 1
symmnumber: 1
zpe: 472561.8 jmol-1
zpe.correction: 0.179989 hartree
zpe.thermalcorrener: 0.194202 hartree
zpe.thermalcorrenthalpy: 0.195146 hartree
zpe.thermalcorrgfe: 0.134954 hartree
zpe.sumelectzpe: -696.818453 hartree
zpe.sumelectthermal: -696.804241 hartree
zpe.sumelectthermalent: -696.803296 hartree
zpe.sumelectthermalfe: -696.863489 hartree
dipole: -0.4417 1.7451 0.0429
dipole: 1.8007
quadrupole: -81.8538 -105.0353 -105.2396
quadrupole: 1.1699 -0.2064 -0.0900
quadrupole: 15.5224 -7.6591 -7.8634 1.1699 -0.2064 -0.0900
hfenergy: -696.9984427 hartree
pointgroup: C01 [X(C11H9Br1N2O2)]
dipole: 0.2565582 -0.6515886 0.1072224 debye
dipolederiv: -0.4988811 -0.1273054 0.0046125 -0.3736585 -0.3620064 0.0256835 0.0439454 0.0352253 -0.1022358 -0.8669284 -0.335933 0.0148847 -0.0687767 -0.3435534 0.0246493 -0.0203101 0.0131226 -0.1303998 -0.647951 -0.3704876 0.0384368 0.5401391 -0.8644763 0.0870282 -0.0854475 0.0518992 -0.3417364 -1.7448312 0.277017 -0.0874453 0.7224929 -0.6444512 0.0747705 -0.1491231 0.0575505 -0.2725484 -0.0041493 0.2274677 -0.0213574 0.1031652 -0.1607665 0.0010166 -0.0041367 0.0069501 -0.1826614 0.0309725 0.0010859 0.0002921 0.0706341 0.0248578 0.0035945 -0.0103936 -0.0000338 0.0306985 1.0418935 0.1536808 0.0153957 -0.0758838 0.0757744 -0.0049669 0.0447896 0.0043455 0.0701841 -0.8493577 -0.1023573 -0.0098248 -0.1733793 -0.1304214 -0.0170835 -0.0018947 -0.0140098 -0.2121773 1.5310031 0.0074096 0.0482199 0.0994082 0.3628417 -0.02002 0.0404216 -0.0232913 0.1666446 -0.0191416 -0.0730159 0.0112374 -0.0058045 -0.0203264 -0.0137151 0.0033821 -0.0164746 -0.1437255 -0.0953724 0.0633132 -0.0060845 -0.0356633 0.0301575 -0.0186366 0.006172 -0.0160629 -0.1300533 -0.1414894 0.0422658 -0.0044186 0.1052647 0.1462321 -0.0301567 -0.0109533 -0.0320164 -0.15123 0.0468277 -0.1392077 0.0212998 -0.1888123 -0.0154467 -0.020468 0.0266233 -0.0190895 -0.1462171 0.0432948 0.0361595 0.0018494 0.0290795 -0.0142678 -0.014855 0.003054 -0.0141393 -0.1524155 1.3104775 0.1098619 0.0242403 -1.5359513 1.1005948 -0.1633182 0.2498475 -0.1039976 0.2353 0.1355492 0.2438047 -0.0345744 0.7222937 0.5996109 -0.0565123 -0.111063 -0.0726576 0.0671787 0.1990511 0.0167595 -0.0030208 0.0140081 0.0654652 0.0185575 -0.002085 0.0187601 0.2101543 -0.0110456 0.1048311 -0.0162595 0.115021 0.0330768 0.0162596 -0.0174453 0.016293 0.1465381 0.1424069 -0.041905 0.0042953 -0.0298695 -0.0182725 0.0179657 0.0020069 0.0178584 0.1544657 0.4625044 0.0478411 -0.0030578 0.1022724 0.2006126 0.0185652 -0.0102354 0.0169941 0.3118429 0.0633668 -0.0298052 0.0003074 -0.0655669 -0.1102772 0.0278458 0.0044356 0.0291084 0.1568378 -0.0596652 0.0892225 -0.0165185 0.111864 0.0045978 0.0202618 -0.0190384 0.0194394 0.1544424 -0.1155092 -0.0696918 -0.0007124 -0.0732395 0.0693715 0.0079523 -0.0002511 0.0082151 0.1606362 0.0220424 -0.063469 0.017909 -0.042642 -0.0300226 -0.0548076 0.0683221 -0.0252625 0.0688874 0.0249319 -0.0675424 0.0002936 -0.0663952 0.0010957 0.0703894 -0.0506231 0.0412736 0.0315896 unknown
polarizability: 267.2837572|21.8382794|159.3048319|4.0843125|-11.3473806|63.5230907 unknown
InChI: InChI=1S/C11H9BrN2O2/c12-7-10(15)13-11-6-9(14-16-11)8-4-2-1-3-5-8/h1-6,13H,7H2
charge 0 multiplicity 1
25 atoms
Br 5.862577 1.380696 0.088145
O  0.887324 1.990807 -0.131494
O  2.970688 -1.674905 0.405605
N  2.793512 0.640007 0.105262
N  -0.582126 1.882718 -0.171932
C  -2.223518 0.057622 -0.004748
C  -0.830525 0.549644 -0.016384
C  0.381478 -0.224466 0.122931
C  1.402531 0.703885 0.045485
C  -2.497757 -1.328192 0.140704
C  -3.308828 0.967285 -0.138573
C  -3.829207 -1.795551 0.152171
C  -4.636461 0.496844 -0.126636
C  -4.903358 -0.886153 0.018672
C  3.506219 -0.535318 0.281204
C  5.032368 -0.455801 0.335467
H  0.498228 -1.293382 0.259973
H  -1.675317 -2.043998 0.2446
H  -3.096237 2.035334 -0.2501
H  3.313963 1.52072 0.009991
H  -4.027744 -2.86689 0.26501
H  -5.46469 1.206308 -0.23019
H  -5.936742 -1.249804 0.027582
H  5.456405 -1.086234 -0.460244
H  5.380321 -0.810579 1.317399
