program: Gaussian 09
title: 000216896
version: EM64L-G09RevD.01
frameworkgroup: C1[X(C12H11ClN2O2)]
method: RPBEPBE
basis: SDD
operation: Freq
keyword: #p
keyword: freq=noraman
keyword: PBEPBE/SDD
title: #p freq=noraman PBEPBE/SDD
converged: YES YES NO NO
title: Mulliken charges:
elementType: Cl O O N N C C C C C C C C C C C C H H H H H H H H H H H
charge: -0.074985 -0.227161 -0.231723 -0.387838 -0.069786 0.098060 0.348828 0.314939 -0.435282 -0.448053 0.265973 -0.351923 -0.351991 -0.624554 -0.244801 -0.230527 -0.233668 0.297801 0.300932 0.350720 0.228210 0.270723 0.247543 0.239205 0.256327 0.229878 0.231075 0.232076
chargesum: 0.00000
title: Mulliken charges with hydrogens summed into heavy atoms:
elementType: Cl O O N N C C C C C C C C C C C C
charge: -0.074985 -0.227161 -0.231723 -0.037118 -0.069786 0.098060 0.348828 0.314939 -0.137481 -0.147120 0.265973 -0.123713 -0.081267 0.118522 -0.014923 0.000548 -0.001593
polarizability: 2.68971503e+02 -4.73671790e+00 1.62733585e+02 -1.47667383e+00 -5.17787622e+00 7.37865648e+01
1716.lowfreq: -9.3327 -3.8028 -0.0014 0.0008 0.0014 3.4805 17.1314 25.8612 41.7880
frequency: 17.0072 25.8302 41.7802 57.8544 88.2621 110.9001 129.7696 177.2015 223.2016 250.3966 274.7994 305.4613 327.4271 334.1503 366.2418 377.7062 399.6785 453.9954 490.9867 502.3782 615.3857 623.7149 648.0575 667.9358 680.0147 693.5072 697.5966 730.4152 773.0357 782.1501 822.6265 839.5110 856.9111 901.2803 924.1034 934.7714 967.2868 984.5061 988.2658 990.2570 1003.6775 1023.7416 1050.4712 1067.9306 1077.7927 1087.7490 1175.1198 1190.3833 1191.4017 1198.5825 1213.0103 1249.3975 1286.5094 1310.1580 1364.3548 1388.9175 1389.9994 1422.7361 1449.3977 1462.5444 1473.3518 1510.4277 1512.2048 1586.6386 1595.3073 1617.8070 1622.7711 3002.2366 3083.0520 3104.3004 3120.0854 3129.0589 3138.0137 3149.9586 3159.6416 3170.6243 3276.9945 3456.5108
redmass: 3.8571 8.1164 4.6449 6.7967 6.4631 5.4931 9.7893 6.5181 3.4830 1.1521 3.5154 4.7072 6.9417 7.8105 7.0779 9.0639 2.7972 5.8764 3.8891 5.2460 6.4577 7.7507 4.1863 5.9362 2.2578 2.9777 2.0116 1.5405 5.1178 1.8212 10.5080 1.4799 1.2661 5.2716 8.1971 1.4430 4.2255 1.3849 1.7873 5.3245 1.3311 2.5840 1.7883 1.6399 2.6614 1.7024 1.0615 2.8424 1.3501 1.5167 1.2561 3.2250 1.3711 1.6693 2.8741 2.1491 2.0808 3.0247 2.5751 1.0472 1.0548 3.2871 2.3418 6.3667 6.8814 6.2528 9.1774 1.0351 1.0877 1.0986 1.1012 1.0849 1.0881 1.0929 1.0965 1.1014 1.0993 1.0769
irintensity: 0.4387 0.0473 2.4363 0.4672 11.6235 2.9946 0.7072 8.1032 3.4947 0.5875 7.1027 2.4309 1.1107 5.1841 0.5712 9.0546 0.0210 9.1567 5.6163 12.0347 0.0117 3.7294 44.2019 21.4300 1.4136 27.4476 40.2458 87.5650 5.4315 61.5171 30.9600 33.2415 4.6555 12.4844 9.4118 5.0341 13.0619 0.0773 13.2060 0.9573 0.3403 4.9248 12.4157 46.4151 4.3945 8.3312 0.0244 0.5615 7.5018 0.2736 26.1566 26.3173 1.0896 0.8178 0.4157 8.8452 14.6347 84.8924 6.6192 19.5804 7.5519 29.7358 613.2311 67.5483 169.5968 27.6061 155.2806 8.0288 0.2658 9.8027 17.5815 1.1939 4.9749 26.4526 19.3612 18.3867 4.0605 152.7996
temp: 298.150 k
press: 1.00000 atm
elementType: 17 8 8 7 7 6 6 6 6 6 6 6 6 6 6 6 6 1 1 1 1 1 1 1 1 1 1 1
symmnumber: 1
zpe: 546628.9 jmol-1
zpe.correction: 0.208200 hartree
zpe.thermalcorrener: 0.223653 hartree
zpe.thermalcorrenthalpy: 0.224597 hartree
zpe.thermalcorrgfe: 0.162327 hartree
zpe.sumelectzpe: -1182.648527 hartree
zpe.sumelectthermal: -1182.633074 hartree
zpe.sumelectthermalent: -1182.632130 hartree
zpe.sumelectthermalfe: -1182.694401 hartree
dipole: 1.0337 2.3217 0.2752
dipole: 2.5563
quadrupole: -83.1365 -109.2704 -108.4820
quadrupole: 1.0620 1.8527 0.4346
quadrupole: 17.1598 -8.9741 -8.1857 1.0620 1.8527 0.4346
hfenergy: -1182.8567273 hartree
pointgroup: C01 [X(C12H11Cl1N2O2)]
dipole: 0.4712652 -0.8846969 0.0818616 debye
polarizability: 266.3499156|14.6438463|159.818279|15.3197566|-18.7157143|79.323458 unknown
InChI: InChI=1S/C12H11ClN2O2/c1-8(13)12(16)14-11-7-10(15-17-11)9-5-3-2-4-6-9/h2-8,14H,1H3
charge 0 multiplicity 1
28 atoms
Cl 5.299348 1.584647 0.608674
O  0.543984 2.003519 -0.24204
O  2.643859 -1.476504 1.000903
N  2.449696 0.759621 0.336072
N  -0.916372 1.848539 -0.369863
C  -1.152258 0.548175 -0.028475
C  -2.533433 0.023712 -0.040164
C  1.067284 0.774283 0.168565
C  0.058859 -0.160249 0.315049
C  4.696191 -0.220922 0.862229
C  3.169295 -0.355138 0.741125
C  -2.794705 -1.325631 0.317256
C  -3.62018 0.864377 -0.408374
C  5.434429 -1.134933 -0.121944
C  -4.114683 -1.824577 0.30772
C  -4.936454 0.362639 -0.41655
C  -5.190367 -0.983557 -0.058633
H  0.184699 -1.191441 0.624309
H  4.976116 -0.438174 1.905193
H  2.966192 1.631635 0.164147
H  -1.971031 -1.988356 0.603457
H  -3.417685 1.904326 -0.683899
H  6.522545 -1.079151 0.042013
H  5.216553 -0.855527 -1.166352
H  5.099658 -2.174647 0.042638
H  -4.303211 -2.867263 0.585682
H  -5.765857 1.019189 -0.701331
H  -6.214871 -1.371592 -0.065607
