program: Gaussian 09
title: 000015243
version: EM64L-G09RevD.01
frameworkgroup: C1[X(C7H2F12O2)]
method: RPBEPBE
basis: SDD
operation: Freq
keyword: #p
keyword: freq=noraman
keyword: PBEPBE/SDD
title: #p freq=noraman PBEPBE/SDD
converged: YES YES NO NO
title: Mulliken charges:
elementType: F F F F F F F F F F F F O O C C C C C C C H H
charge: -0.134619 -0.131282 -0.118295 -0.122249 -0.147640 -0.114251 -0.137473 -0.127158 -0.125530 -0.137077 -0.158731 -0.154585 -0.377428 -0.151548 0.242254 0.254593 0.264100 0.257184 0.242928 0.076143 0.142707 0.246391 0.411566
chargesum: 0.00000
title: Mulliken charges with hydrogens summed into heavy atoms:
elementType: F F F F F F F F F F F F O O C C C C C C C
charge: -0.134619 -0.131282 -0.118295 -0.122249 -0.147640 -0.114251 -0.137473 -0.127158 -0.125530 -0.137077 -0.158731 -0.154585 0.034137 -0.151548 0.242254 0.254593 0.264100 0.257184 0.242928 0.322534 0.142707
polarizability: 9.60823732e+01 3.77080297e+00 8.33491867e+01 4.36768499e+00 -2.40350677e+00 8.13247487e+01
1716.lowfreq: -6.7866 -0.9646 0.0004 0.0006 0.0010 8.4880 29.6544 40.5283 43.2776
frequency: 29.5704 40.5273 43.2623 58.4353 68.5488 94.2261 100.4330 120.3780 135.7020 153.2712 173.0038 211.2981 224.9801 229.0559 247.0883 251.0832 254.9674 273.7811 281.5925 286.0673 296.9451 305.8865 331.8469 341.5823 344.4108 384.3573 415.0679 435.5431 456.2011 491.2911 525.7579 549.7097 565.5403 568.5057 583.2059 593.9157 640.0749 707.3025 740.5918 833.2106 892.0825 950.3555 980.6373 990.4740 1001.4694 1017.4400 1024.3960 1034.7893 1036.1226 1048.7952 1063.5975 1105.3662 1120.7909 1137.0660 1144.1730 1150.7511 1161.2155 1299.7754 1308.6496 1344.4576 1688.6898 3101.2465 3526.5050
redmass: 11.8779 15.3995 12.2270 13.7998 13.0643 13.7613 16.3677 16.0973 14.2596 14.8800 15.1051 16.6212 15.5312 12.8343 16.8140 16.5135 16.2473 15.8829 18.0760 17.8734 18.6019 17.9586 15.3733 16.5763 13.1676 13.5249 15.2477 15.5894 9.1889 11.9495 5.0334 10.2053 10.7928 13.8276 13.2381 1.8621 4.1584 7.3424 7.0902 11.5982 11.2286 12.3621 11.8070 11.8200 9.1767 7.8222 5.8083 9.1945 8.2615 10.9323 9.9873 4.3142 12.4887 9.9140 10.6476 8.4719 9.7043 1.1814 2.5087 1.3120 11.7016 1.0882 1.0649
irintensity: 1.5451 0.2336 1.0500 1.3364 1.4450 0.8873 0.7081 1.3135 0.4548 2.2316 0.8080 15.3850 1.3561 1.3422 0.7304 1.7601 1.1361 0.0696 1.7408 1.1452 0.2948 0.2893 1.7495 2.3642 3.0782 2.7408 13.9348 1.1634 1.0258 13.6391 18.0858 9.2128 21.5185 5.4889 15.3257 89.6643 128.6884 28.4173 73.9177 187.3598 55.7466 122.4629 19.8892 43.3868 46.4450 53.1170 295.9444 63.6526 124.9910 65.1461 320.5967 3.0308 6.1006 52.6102 21.5095 10.7193 15.2223 3.5014 19.0069 5.8692 207.4644 8.8446 73.0595
temp: 298.150 k
press: 1.00000 atm
elementType: 9 9 9 9 9 9 9 9 9 9 9 9 8 8 6 6 6 6 6 6 6 1 1
symmnumber: 1
zpe: 260289.9 jmol-1
zpe.correction: 0.099139 hartree
zpe.thermalcorrener: 0.120041 hartree
zpe.thermalcorrenthalpy: 0.120986 hartree
zpe.thermalcorrgfe: 0.048741 hartree
zpe.sumelectzpe: -1614.816911 hartree
zpe.sumelectthermal: -1614.796009 hartree
zpe.sumelectthermalent: -1614.795064 hartree
zpe.sumelectthermalfe: -1614.867309 hartree
dipole: 3.3944 -0.2947 2.1446
dipole: 4.0260
quadrupole: -109.3547 -119.4564 -122.6165
quadrupole: 8.4573 4.0013 2.2260
quadrupole: 7.7878 -2.3139 -5.4740 8.4573 4.0013 2.2260
hfenergy: -1614.9160501 hartree
pointgroup: C01 [X(C7H2F12O2)]
dipole: 1.3433154 -0.138538 -0.8277684 debye
dipolederiv: -0.4934683 0.0457014 -0.1509404 -0.0015403 -0.2687647 0.0123935 -0.2466761 0.0807296 -0.5357492 -0.5446015 0.1710518 -0.0045322 0.2236826 -0.4919322 -0.0109323 0.0763344 -0.073999 -0.2599728 -0.3918309 -0.1203808 -0.0358099 -0.210966 -0.5372457 -0.1464822 -0.0214709 -0.0749669 -0.2875146 -0.4680332 0.0159853 -0.1419663 0.0888498 -0.2681231 0.1142081 -0.1874675 0.0323191 -0.4951043 -0.5945755 0.198369 0.0283895 0.2568389 -0.537671 -0.0451546 -0.0429181 0.0352084 -0.2604344 -0.4052329 -0.0148726 0.1237569 -0.0790204 -0.2588624 0.0683599 0.2054601 0.0070873 -0.5532423 -0.4102089 -0.1032723 -0.0294136 -0.146878 -0.4838822 -0.0995463 -0.1133205 -0.1963968 -0.3487905 -0.4980909 -0.1196316 0.1506299 -0.1153176 -0.3640581 0.1044658 0.2171602 0.1677707 -0.4091327 -0.4264053 -0.0290287 0.1100284 0.0281245 -0.2415918 -0.0864401 0.190865 -0.0160989 -0.5075265 -0.4635024 -0.1734252 0.0113049 -0.2224555 -0.5618411 0.0860358 -0.0101515 0.0139628 -0.2608175 -0.3812353 -0.1143406 -0.1681215 -0.0406388 -0.4642459 -0.2037398 -0.0913215 -0.1712935 -0.4208036 -0.5765217 0.2966297 0.1121184 0.206331 -0.4351849 -0.0984978 0.0892343 -0.12183 -0.3352757 -0.7581646 -0.0008163 0.4245906 0.0604018 -0.2853375 -0.146288 0.3909161 -0.0646905 -0.7788152 -0.4403983 0.1499774 -0.0288946 0.0661317 -0.4814024 0.3241021 0.1567449 0.1160793 -0.6808979 0.948669 -0.2895902 0.2020116 -0.1135171 0.7187541 0.0008666 0.1039207 -0.0178734 0.7479761 0.8551464 0.1434058 0.2473318 0.0882599 0.7828732 0.0284443 0.1061734 0.0275545 0.791328 0.9599375 -0.2219431 -0.2144174 -0.0929369 0.7584814 -0.0186014 -0.0740193 -0.0433196 0.7834876 0.9174416 0.2515806 -0.1406554 0.2554259 0.8312931 0.0459266 -0.1534082 0.0143671 0.7201933 0.9037573 0.2929158 -0.1290506 0.2523622 0.7848589 -0.0008097 -0.1869791 0.1415517 0.7868322 0.9875685 -0.1766708 0.0140162 -0.1610871 0.9298928 0.3136259 0.0709347 0.2241958 0.7974544 0.8469398 -0.2510902 -0.3572685 -0.368747 0.6119602 -0.3409026 -0.4909089 -0.1951097 1.1723765 0.0374165 -0.0211112 0.0085939 -0.0675079 0.0241242 0.0043012 0.0586268 0.0174095 0.0110861 0.3953931 0.0705567 -0.0317019 0.0942045 0.2379053 0.094665 -0.047729 0.0973424 0.3233429 unknown
polarizability: 96.2626854|-4.7336294|81.5564885|-2.8165925|-2.6033101|82.9371347 unknown
InChI: InChI=1S/C7H2F12O2/c8-1(9)3(10,11)5(14,15)7(18,19)6(16,17)4(12,13)2(20)21/h1,20H
charge 0 multiplicity 1
23 atoms
F  -0.649878 -0.391007 -2.063514
F  0.974322 -1.666534 -1.062872
F  -1.524212 -2.172742 -0.207738
F  -0.173347 -1.305899 1.412594
F  0.153095 1.842686 -0.636272
F  1.702855 0.835877 -1.967967
F  -1.492583 1.066482 1.429704
F  -2.923714 -0.709995 1.529591
F  1.384941 0.971216 1.636828
F  2.844607 1.957139 0.191147
F  -3.503738 -0.365275 -1.252719
F  -3.940213 1.415231 0.125313
O  3.852247 -0.497013 -0.537532
O  3.06643 -1.179388 1.559265
C  0.104776 -0.562691 -0.872073
C  -0.917242 -0.981671 0.254535
C  1.016078 0.715539 -0.741854
C  -2.068349 0.013013 0.670926
C  2.075148 0.785942 0.422883
C  -2.905532 0.658892 -0.474806
C  3.040753 -0.431634 0.574113
H  -2.313993 1.321571 -1.127223
H  4.493847 -1.255437 -0.472628
