program: Gaussian 09
title: 000216873
version: EM64L-G09RevD.01
frameworkgroup: C1[X(C11H15N3O3)]
method: RPBEPBE
basis: SDD
operation: Freq
keyword: #p
keyword: freq=noraman
keyword: PBEPBE/SDD
title: #p freq=noraman PBEPBE/SDD
converged: YES YES NO NO
title: Mulliken charges:
elementType: O O O N N N C C C C C C C C C C C H H H H H H H H H H H H H H H
charge: -0.264594 -0.288691 -0.335820 -0.376112 -0.398391 -0.635819 0.204701 0.443047 -0.314504 -0.552909 0.338011 -0.372610 -0.827233 0.289164 0.272352 -0.612939 -0.537438 0.252376 0.260588 0.246204 0.275237 0.230445 0.224047 0.373820 0.225844 0.269121 0.226286 0.351122 0.342171 0.247386 0.226168 0.218969
chargesum: 0.00000
title: Mulliken charges with hydrogens summed into heavy atoms:
elementType: O O O N N N C C C C C C C C C C C
charge: -0.264594 -0.288691 -0.335820 -0.376112 -0.024571 0.057474 0.204701 0.443047 -0.062128 -0.292321 0.338011 -0.126406 -0.097503 0.289164 0.272352 0.108312 0.155085
polarizability: 2.16690125e+02 3.31876625e+00 1.21786380e+02 4.66812704e+00 -5.45232295e+00 1.22190100e+02
1716.lowfreq: -8.1399 -3.9810 0.0002 0.0005 0.0005 3.2641 33.2811 51.6326 54.7796
frequency: 33.2631 51.6134 54.7556 79.0277 86.0288 98.3123 110.6180 139.9911 158.6594 173.1100 181.7371 218.1670 220.9047 246.0088 261.7240 314.3556 349.4750 389.3275 394.1065 410.5711 427.9742 462.6003 502.7045 518.7781 536.3565 561.3528 575.3520 587.3704 617.8606 699.5216 713.6065 724.9540 731.0356 771.3563 805.7111 841.3066 876.8586 880.4874 925.1473 935.3765 981.4460 1026.0933 1035.4318 1047.8592 1060.6368 1107.7184 1112.0276 1122.7246 1127.2216 1145.3574 1148.8208 1180.0859 1204.4923 1221.6435 1271.1089 1282.7212 1375.2239 1384.7387 1395.8369 1419.2026 1419.8131 1438.5785 1464.4420 1467.2676 1471.5925 1472.4383 1477.8128 1486.7138 1495.1876 1531.2243 1569.4592 1578.4630 1617.7900 1626.5012 1673.1571 2960.4210 2976.0961 2982.6651 3049.1129 3052.5964 3064.1429 3093.8254 3110.6507 3127.0909 3142.3591 3154.3859 3169.1027 3286.0849 3535.4771 3692.2030
redmass: 4.0893 4.8236 4.4796 1.0825 3.9555 3.4441 7.9692 1.1521 2.5985 3.7574 3.5937 2.5258 2.2262 1.7697 4.6429 3.2763 5.4294 5.6375 4.7060 4.6870 6.2617 3.1534 1.2121 2.6578 1.7375 2.6661 3.5930 4.2449 3.1607 11.1533 6.1461 4.5471 5.8782 3.9262 1.4437 1.1088 3.0584 1.7090 4.5645 1.4090 2.2271 2.1492 3.5573 1.7057 2.0140 3.7933 1.2758 1.2937 2.0360 1.5110 1.8056 1.5698 2.3565 2.7780 1.5345 4.5575 7.4387 4.8419 1.2427 2.1813 1.2806 1.2630 1.0641 1.0503 1.0963 1.0772 1.4554 1.0465 1.9788 2.2681 1.3483 6.5555 3.0455 5.6469 5.6329 1.0331 1.0356 1.0370 1.1040 1.1017 1.0972 1.0996 1.0983 1.0994 1.0890 1.0919 1.0956 1.0831 1.0450 1.1047
irintensity: 0.3459 0.8261 1.2613 0.5764 5.5475 5.3682 4.8995 1.0230 5.1845 1.9590 2.9969 2.7258 4.1416 0.3434 0.5430 0.8028 32.0257 2.1531 23.7960 3.9236 0.2557 9.2839 133.1384 41.3550 31.4053 18.9359 9.2261 20.9466 28.1431 0.2304 1.0059 7.2398 12.6806 3.8532 22.9721 138.1555 6.5630 16.4738 7.0900 1.4201 12.7535 46.5483 14.3003 11.9941 2.8797 64.1429 0.5594 0.8394 32.5176 22.9875 93.6994 44.5141 91.7258 133.7836 11.6735 61.8447 30.4310 338.8823 17.7152 12.4342 51.8760 3.6030 33.2010 13.8479 128.0478 12.3209 14.3052 13.3301 155.3866 393.5908 239.7815 44.2087 60.6063 99.5424 374.6286 67.2697 92.2823 18.1138 45.7830 37.7795 9.6091 21.1808 5.6520 25.3735 7.1400 4.3398 8.8185 242.7783 43.7467 65.7884
temp: 298.150 k
press: 1.00000 atm
elementType: 8 8 8 7 7 7 6 6 6 6 6 6 6 6 6 6 6 1 1 1 1 1 1 1 1 1 1 1 1 1 1 1
symmnumber: 1
zpe: 666945.1 jmol-1
zpe.correction: 0.254026 hartree
zpe.thermalcorrener: 0.271766 hartree
zpe.thermalcorrenthalpy: 0.272710 hartree
zpe.thermalcorrgfe: 0.207879 hartree
zpe.sumelectzpe: -816.861347 hartree
zpe.sumelectthermal: -816.843607 hartree
zpe.sumelectthermalent: -816.842663 hartree
zpe.sumelectthermalfe: -816.907494 hartree
dipole: -2.9821 2.7657 -0.7008
dipole: 4.1271
quadrupole: -87.3126 -101.6237 -93.9812
quadrupole: -7.3756 7.9755 -0.8333
quadrupole: 6.9932 -7.3179 0.3246 -7.3756 7.9755 -0.8333
hfenergy: -817.115373 hartree
pointgroup: C01 [X(C11H15N3O3)]
dipole: 1.1746006 0.9561122 0.5853593 debye
polarizability: 216.2733516|-6.1486484|119.1880697|6.0024713|4.3618996|125.2051834 unknown
InChI: InChI=1S/C11H15N3O3/c1-7-6-8(17-3)4-5-9(7)14(10(12)15)11(16)13-2/h4-6,13H,12H2,1-3H3
charge 0 multiplicity 1
32 atoms
O  4.295354 -0.38785 -0.200624
O  -1.559074 -1.929829 -0.225811
O  -3.07517 1.9227 0.559156
N  -1.310396 0.369988 0.208966
N  -3.48046 -0.649531 0.179831
N  -0.892836 2.685124 0.493249
C  0.129211 0.171323 0.110791
C  0.76116 0.094168 -1.16559
C  0.883308 0.044776 1.294724
C  2.158324 -0.088667 -1.202964
C  2.918735 -0.205867 -0.011884
C  2.282359 -0.139755 1.252427
C  -0.048677 0.168921 -2.442927
C  -2.129298 -0.831145 0.036748
C  -1.828098 1.670631 0.429909
C  -4.415568 -1.766274 0.025727
C  5.126368 -0.562734 0.993723
H  0.363792 0.078364 2.258478
H  2.684256 -0.159956 -2.160412
H  2.84461 -0.240943 2.184705
H  -0.662965 -0.744464 -2.549806
H  -0.743207 1.028816 -2.438114
H  0.604627 0.253071 -3.327195
H  -3.801016 0.315255 0.38099
H  -5.036756 -1.884645 0.932683
H  -3.837141 -2.68977 -0.13473
H  -5.08413 -1.609796 -0.841902
H  0.106979 2.512188 0.411324
H  -1.247811 3.625289 0.651052
H  6.148929 -0.701254 0.613626
H  4.817815 -1.45635 1.570012
H  5.089075 0.331817 1.645838
