program: Gaussian 09
title: 000216869
version: EM64L-G09RevD.01
frameworkgroup: C1[X(C10H24NO)]
method: RPBEPBE
basis: SDD
operation: Freq
keyword: #p
keyword: freq=noraman
keyword: PBEPBE/SDD
title: #p freq=noraman PBEPBE/SDD
converged: YES YES NO NO
title: Mulliken charges:
elementType: O N C C C C C C C C C C H H H H H H H H H H H H H H H H H H H H H H H H
charge: -0.313337 -0.105030 -0.354497 -0.305042 -0.309034 -0.306096 -0.275638 -0.703220 -0.694111 -0.710489 -0.210022 -0.669567 0.254615 0.266177 0.240633 0.315590 0.263483 0.264786 0.258658 0.285703 0.219562 0.234004 0.266070 0.235825 0.242319 0.268765 0.229920 0.244066 0.264974 0.241363 0.240132 0.207158 0.218688 0.236083 0.234110 0.223397
chargesum: 1.00000
title: Mulliken charges with hydrogens summed into heavy atoms:
elementType: O N C C C C C C C C C C
charge: -0.313337 -0.105030 0.166296 0.251181 0.219235 0.238266 0.177929 0.040994 0.048640 0.035980 0.215824 0.024022
polarizability: 1.32463631e+02 2.43048359e+00 1.10653598e+02 2.32321944e+00 9.16636384e-01 1.09028500e+02
1716.lowfreq: -20.7609 -10.1157 -0.0001 0.0006 0.0007 0.5765 22.9409 49.5970 76.3577
frequency: 19.8533 48.9151 76.3390 96.0921 101.3879 116.8255 160.0738 164.0293 216.9058 219.6965 234.5192 242.3151 256.2471 270.4645 306.9466 316.9081 342.3321 366.7129 402.9881 411.8401 449.2231 507.6228 562.0991 639.0180 762.1275 782.4545 785.7129 811.5580 815.1492 847.4361 869.8632 876.0614 927.8545 992.7014 1011.5080 1020.9462 1034.8760 1037.3478 1064.6785 1073.8194 1087.3724 1111.1247 1114.8884 1125.5496 1139.5377 1158.5627 1169.6486 1185.9939 1225.0846 1257.6085 1279.6040 1290.6363 1300.1893 1335.3096 1347.6614 1357.2953 1372.7900 1375.8546 1389.9842 1399.3496 1411.3218 1412.9470 1414.5663 1420.4001 1455.0795 1464.5128 1465.3169 1472.6490 1474.1385 1475.9894 1477.7571 1479.1716 1484.3188 1487.4711 1490.5432 1491.6024 1499.0839 1502.4960 2939.7809 2955.6206 2981.4320 3000.6079 3005.7277 3007.2531 3008.1986 3012.8842 3032.2847 3039.4359 3041.2650 3052.0404 3090.7715 3092.3116 3092.9740 3095.9203 3098.9048 3100.1388 3101.7153 3106.3239 3117.0048 3120.2021 3120.8596 3126.7151
redmass: 2.8940 2.3246 1.8413 1.9555 1.7508 2.8064 2.2066 3.0291 2.1507 1.2693 1.3570 1.1683 2.0453 2.3942 1.8561 2.1636 2.1101 2.1633 2.7931 2.9511 2.8008 2.9421 2.3396 2.8649 2.2122 1.4105 1.5212 1.3078 1.0999 1.6275 1.8023 1.8881 2.2621 2.3326 1.8939 2.1822 2.6387 2.8930 1.9565 2.0646 3.4231 1.9744 2.3167 1.8814 1.5367 1.8168 1.8696 1.8628 1.1871 1.1415 1.1293 1.1032 1.1182 1.2266 1.2129 1.2243 1.2934 1.3057 1.2622 1.2301 1.2662 1.2408 1.2603 1.1959 1.0805 1.0577 1.0485 1.0734 1.0669 1.0563 1.0477 1.0532 1.0551 1.0489 1.0501 1.0731 1.0652 1.0752 1.0568 1.0562 1.1046 1.0364 1.0375 1.0379 1.0378 1.1078 1.0602 1.0604 1.0598 1.0601 1.0998 1.1038 1.0976 1.0980 1.1005 1.0991 1.1025 1.1016 1.1034 1.1042 1.1032 1.1058
irintensity: 0.5280 0.2360 0.9227 1.8391 3.1336 7.3102 0.7812 1.6219 2.4337 0.1140 0.0928 1.3588 0.6348 3.9984 0.3657 0.1993 0.1165 0.2880 5.6509 0.6191 1.8418 1.1847 1.5767 0.1509 27.9770 22.5433 8.5500 11.5743 2.2211 6.8186 0.9135 1.1560 25.6275 38.7823 14.6436 15.3170 60.3864 44.0587 4.7922 10.8519 69.7873 18.3643 6.6183 2.9467 6.5209 4.6816 4.3160 4.5581 5.5463 1.7886 2.4770 4.2908 2.5510 5.9604 20.2780 0.9837 0.0337 1.4834 3.4399 20.2695 27.2838 24.6694 7.3236 35.9818 12.5903 10.9880 13.0812 15.1057 27.7134 6.3366 6.7873 41.7644 10.2885 30.7644 2.2334 9.8891 3.5440 2.4152 30.9212 62.6378 34.7128 9.2247 5.0568 4.9194 5.0236 29.4033 9.3920 7.0141 20.7232 8.4361 5.3817 2.2346 5.7211 5.9554 23.5022 23.1235 7.6003 29.8256 23.6155 5.1542 18.6117 4.6692
temp: 298.150 k
press: 1.00000 atm
elementType: 8 7 6 6 6 6 6 6 6 6 6 6 1 1 1 1 1 1 1 1 1 1 1 1 1 1 1 1 1 1 1 1 1 1 1 1
symmnumber: 1
zpe: 873197.6 jmol-1
zpe.correction: 0.332583 hartree
zpe.thermalcorrener: 0.348563 hartree
zpe.thermalcorrenthalpy: 0.349507 hartree
zpe.thermalcorrgfe: 0.289285 hartree
zpe.sumelectzpe: -524.145115 hartree
zpe.sumelectthermal: -524.129135 hartree
zpe.sumelectthermalent: -524.128191 hartree
zpe.sumelectthermalfe: -524.188413 hartree
dipole: -2.8119 -0.6759 -0.8027
dipole: 3.0014
quadrupole: -48.1982 -64.8984 -65.2232
quadrupole: -2.1642 -1.0182 0.5720
quadrupole: 11.2418 -5.4585 -5.7833 -2.1642 -1.0182 0.5720
hfenergy: -524.477698 hartree
pointgroup: C01 [X(C10H24N1O1)]
dipole: -0.9821513 0.5879957 0.2898256 debye
polarizability: 129.5016377|-6.7124009|112.5472368|-5.0896383|0.8781185|110.0968545 unknown
InChI: InChI=1S/C10H24NO/c1-5-11(6-2,7-3)9-10-12-8-4/h5-10H2,1-4H3
charge 1 multiplicity 1
36 atoms
O  1.967662 -0.046617 -0.344423
N  -0.975224 0.111498 0.306596
C  0.149274 0.975127 0.932704
C  -0.595291 -1.404973 0.381021
C  -2.278603 0.350351 1.114363
C  -1.154251 0.493621 -1.185875
C  1.390201 1.226632 0.069268
C  -0.502627 -2.004857 1.788924
C  -2.926911 1.730269 0.943972
C  -2.342118 -0.160917 -1.903341
C  3.304695 0.106637 -0.983265
C  3.785604 -1.279222 -1.39941
H  -0.297109 1.951456 1.183525
H  0.435738 0.472351 1.869067
H  -1.370775 -1.928924 -0.200487
H  0.374025 -1.474254 -0.137339
H  -2.975328 -0.449482 0.812573
H  -2.01078 0.183111 2.170594
H  -1.243759 1.592663 -1.214367
H  -0.207091 0.207115 -1.671891
H  1.16373 1.861915 -0.813806
H  2.09972 1.797709 0.708038
H  -0.205094 -3.061929 1.668396
H  0.272747 -1.534517 2.416397
H  -1.460891 -2.003676 2.333502
H  -3.820156 1.759889 1.592873
H  -2.277828 2.562426 1.265272
H  -3.268684 1.926483 -0.085075
H  -2.367839 0.240494 -2.932086
H  -2.246459 -1.255097 -1.994071
H  -3.316028 0.07342 -1.443132
H  3.210866 0.784195 -1.857923
H  3.993539 0.571586 -0.248098
H  4.784084 -1.204288 -1.86514
H  3.865521 -1.947556 -0.525323
H  3.099642 -1.735141 -2.133933
