program: Gaussian 09
title: 000211663
version: EM64L-G09RevD.01
frameworkgroup: C1[X(C21H26N2S2)]
method: RPBEPBE
basis: SDD
operation: Freq
keyword: #p
keyword: freq=noraman
keyword: PBEPBE/SDD
title: #p freq=noraman PBEPBE/SDD
converged: YES YES NO NO
title: Mulliken charges:
elementType: S S N N C C C C C C C C C C C C C C C C C C C C C H H H H H H H H H H H H H H H H H H H H H H H H H H
charge: 0.238977 0.014911 0.002178 -0.001266 -0.087008 -0.372489 -0.069163 -0.587809 -0.721578 -0.572955 -0.735858 -0.553773 -0.689603 0.519775 0.530890 -0.430576 -0.395430 -0.391830 -0.427076 -0.227711 -0.233585 -0.229441 -0.239015 -0.242288 -0.242522 0.248321 0.259787 0.238348 0.259450 0.210343 0.245734 0.252129 0.346424 0.215011 0.206308 0.230690 0.210896 0.250790 0.222099 0.253824 0.200785 0.231399 0.226415 0.229203 0.244646 0.225931 0.225621 0.225727 0.225880 0.229812 0.228672
chargesum: 0.00000
title: Mulliken charges with hydrogens summed into heavy atoms:
elementType: S S N N C C C C C C C C C C C C C C C C C C C C C
charge: 0.238977 0.014911 0.002178 -0.001266 0.161313 0.125645 0.190288 -0.131733 -0.123025 -0.151636 -0.043482 -0.553773 -0.012895 0.519775 0.530890 -0.199177 -0.169015 -0.162627 -0.182431 -0.001780 -0.007965 -0.003714 -0.013135 -0.012476 -0.013850
polarizability: 3.44026807e+02 -4.18059847e+01 2.38651339e+02 -1.79918062e+01 -2.31069501e+01 2.28388069e+02
1716.lowfreq: -13.4530 -6.0682 0.0012 0.0022 0.0027 7.3718 21.3309 23.2342 24.9345
frequency: 20.6149 23.1612 24.8238 34.4474 35.6247 51.7445 58.4305 78.7468 89.5580 104.5272 112.4357 127.1615 180.5383 215.8997 216.6454 234.2358 237.9259 244.8372 258.8517 280.9531 298.5682 304.2122 335.5335 349.7170 355.3877 379.9658 401.7715 404.2488 406.1547 414.4455 443.9167 499.2351 503.6135 511.1984 525.2129 558.1052 572.4686 593.4973 601.9091 617.8471 618.3646 653.1266 704.3497 705.8638 743.7610 747.2660 780.8991 796.5358 808.4348 824.8378 852.0419 853.3499 858.7879 885.1951 898.2022 905.4611 910.6658 920.3139 929.0149 948.0879 974.6038 975.2504 976.5869 989.6812 990.6719 994.2984 994.4346 1017.8651 1026.1920 1028.6703 1046.3722 1050.3332 1073.5366 1086.8982 1094.9733 1098.5893 1114.8712 1124.8314 1150.9546 1153.4630 1172.2640 1172.6151 1186.5065 1190.7936 1193.7852 1213.4161 1217.6104 1222.2108 1237.3843 1281.7902 1289.9268 1295.5319 1299.4148 1315.1625 1318.6639 1326.5400 1332.7906 1339.5225 1357.5908 1377.5629 1382.2913 1383.2645 1388.6605 1392.1210 1417.0998 1440.2799 1441.2541 1447.2162 1460.9144 1468.2829 1475.2869 1476.9794 1478.6789 1482.2643 1483.6445 1486.5492 1490.6583 1591.8585 1593.7811 1613.0376 1615.7046 2921.0035 2980.4664 2983.8114 2984.2217 2986.1016 2992.9286 3017.9946 3039.7520 3045.8779 3047.9121 3072.9229 3076.0293 3080.4064 3095.1330 3099.0631 3109.3405 3115.6032 3116.4072 3117.8942 3129.0791 3132.2138 3133.1079 3143.8820 3144.0130 3162.8113 3163.1609
redmass: 4.9687 4.4662 4.8278 5.4844 5.1378 4.5815 3.8024 6.3061 3.9816 6.4799 3.2899 3.5963 4.4741 1.2711 3.1480 3.2689 2.5153 3.1695 1.1997 3.6249 4.5799 3.4436 4.1789 2.2905 1.9964 3.9194 3.1154 2.8304 3.5115 4.2394 4.2929 3.3408 3.1484 3.3774 3.5067 5.3124 6.7006 4.3761 4.1479 6.3028 6.3168 4.6517 1.8740 1.8577 1.8405 1.8647 3.0477 3.4705 3.3406 3.2722 1.3368 1.2567 2.2318 1.4276 1.5261 1.8050 1.8976 1.4830 1.5977 3.4450 1.3914 1.4053 1.8559 5.8416 4.3436 1.4284 1.3323 2.1172 2.1830 2.1972 1.6111 2.3211 2.0316 2.4719 1.8930 1.9874 1.7154 1.8774 2.3481 2.2613 1.0558 1.0615 1.1110 1.1728 1.3958 2.1383 2.3321 1.7259 1.6304 1.3624 1.3335 1.3983 1.4660 1.3305 1.4205 1.9024 1.2709 1.3042 1.3050 1.4451 6.9878 7.1686 1.2420 1.2193 1.3729 2.0875 2.1065 1.1256 1.0992 1.0930 1.0736 1.0692 1.0801 1.8083 1.3207 1.9099 1.0746 6.0078 6.0022 6.1847 6.0921 1.0702 1.0405 1.0549 1.0472 1.0639 1.0718 1.0870 1.0975 1.0594 1.0995 1.0941 1.0974 1.0949 1.1004 1.0994 1.0879 1.0872 1.0869 1.0868 1.1117 1.0901 1.0911 1.0955 1.0958 1.1014 1.1014
irintensity: 0.0473 0.0249 0.4550 1.4478 0.6256 0.1821 0.4024 0.2134 0.0087 0.7040 0.7351 0.3461 1.1440 0.0374 3.2533 0.6539 0.2750 4.1780 0.2866 2.0677 4.7860 11.1345 1.8037 3.1935 0.2140 5.9149 4.7166 0.0426 8.7846 5.3877 3.6406 28.5451 0.5098 5.7593 20.3896 44.2781 12.3731 5.4608 2.8025 0.0410 0.2390 2.6317 57.8215 36.3369 98.2183 0.5395 8.5333 19.4106 1.7799 4.0112 2.7643 1.8582 10.1597 1.8339 0.9375 15.4288 7.4809 3.0031 1.1436 152.6173 0.0871 0.8966 1.9061 0.0721 0.0870 0.2754 0.2539 9.6628 8.6206 5.9051 6.9794 9.5781 2.3037 40.0832 10.4524 6.2567 148.1942 26.2487 80.5312 34.7535 0.2182 1.6991 0.2696 9.4982 42.9768 11.7521 0.3664 6.6668 19.6068 75.7329 22.2121 60.8236 22.9855 0.3462 6.4828 118.9921 2.6752 0.3728 7.0345 52.5353 0.6488 0.2146 34.8936 26.3491 6.1735 4.5199 10.1878 11.9210 2.5884 0.3195 14.0658 11.2492 5.4730 39.6771 8.3699 10.0729 8.4662 1.9533 1.0136 18.9557 5.0114 36.8620 7.3596 29.5013 34.5562 7.6717 28.0917 6.4054 20.4220 6.3783 20.5036 30.4439 41.3823 19.2482 17.5586 31.9195 14.8143 8.2368 9.1444 2.6006 5.2892 7.3017 10.7988 38.6379 36.7636 24.6085 26.1494
temp: 298.150 k
press: 1.00000 atm
elementType: 16 16 7 7 6 6 6 6 6 6 6 6 6 6 6 6 6 6 6 6 6 6 6 6 6 1 1 1 1 1 1 1 1 1 1 1 1 1 1 1 1 1 1 1 1 1 1 1 1 1 1
symmnumber: 1
zpe: 1108088.1 jmol-1
zpe.correction: 0.422048 hartree
zpe.thermalcorrener: 0.446693 hartree
zpe.thermalcorrenthalpy: 0.447637 hartree
zpe.thermalcorrgfe: 0.364634 hartree
zpe.sumelectzpe: -1719.600724 hartree
zpe.sumelectthermal: -1719.576080 hartree
zpe.sumelectthermalent: -1719.575136 hartree
zpe.sumelectthermalfe: -1719.658138 hartree
dipole: -2.8062 3.3594 3.9616
dipole: 5.9038
quadrupole: -157.1955 -173.6335 -163.4211
quadrupole: 3.2455 5.0537 -18.5226
quadrupole: 7.5545 -8.8835 1.3290 3.2455 5.0537 -18.5226
hfenergy: -1720.0227723 hartree
pointgroup: C01 [X(C21H26N2S2)]
dipole: 0.9704752 -1.1573797 1.7645638 debye
polarizability: 335.0621056|-47.2533723|253.6800593|28.07628|17.1796552|222.3240502 unknown
InChI: InChI=1S/C21H26N2S2/c1-17(13-19-9-5-3-6-10-19)22-15-23(21(24)25-16-22)18(2)14-20-11-7-4-8-12-20/h3-12,17-18H,13-16H2,1-2H3
charge 0 multiplicity 1
51 atoms
S  -0.219251 1.375173 -2.332837
S  -2.704624 3.140142 -1.89958
N  0.289671 -0.120278 0.068866
N  -1.486391 1.614796 0.051276
C  1.715378 -0.449076 0.392426
C  -0.193779 1.178811 0.619715
C  -2.625613 1.862929 0.993873
C  2.776863 0.504716 -0.270204
C  -0.133834 -0.312724 -1.295751
C  -3.018762 0.57241 1.768294
C  1.908919 -0.549802 1.919015
C  -1.543354 2.071188 -1.259795
C  -2.324087 3.05307 1.932794
C  4.185768 -0.061803 -0.181738
C  -3.582712 -0.532982 0.885083
C  5.142686 0.473835 0.718346
C  4.567884 -1.164582 -0.991723
C  -4.852768 -0.379178 0.269774
C  -2.863445 -1.733506 0.660429
C  6.441876 -0.075685 0.811538
C  5.864214 -1.717885 -0.902279
C  -5.389683 -1.395941 -0.549236
C  -3.398622 -2.756093 -0.157359
C  6.807109 -1.176204 0.002691
C  -4.66403 -2.591007 -0.765303
H  1.879679 -1.459607 -0.0318
H  0.551771 1.974172 0.394257
H  -0.301471 1.101066 1.711969
H  -3.465922 2.155127 0.337979
H  2.740818 1.497235 0.216854
H  2.495615 0.656334 -1.329906
H  0.536766 -0.987275 -1.849949
H  -1.176802 -0.655121 -1.356495
H  -3.77788 0.883762 2.513146
H  -2.153632 0.194609 2.346218
H  1.153342 -1.224254 2.358775
H  1.830223 0.437656 2.411516
H  2.911532 -0.950051 2.144577
H  -3.215275 3.287726 2.542526
H  -2.06922 3.947543 1.33894
H  -1.491372 2.836697 2.628365
H  4.86967 1.331825 1.345477
H  3.849556 -1.583264 -1.708905
H  -5.427332 0.541595 0.433021
H  -1.874253 -1.859566 1.117598
H  7.167998 0.356135 1.509712
H  6.141787 -2.564673 -1.540332
H  -6.370994 -1.25855 -1.017171
H  -2.829496 -3.679048 -0.317846
H  7.814288 -1.602057 0.071192
H  -5.080408 -3.382148 -1.398832
