program: Gaussian 09
title: 000216880
version: EM64L-G09RevD.01
frameworkgroup: C1[X(C10H17N2O4PS)]
method: RPBEPBE
basis: SDD
operation: Freq
keyword: #p
keyword: freq=noraman
keyword: PBEPBE/SDD
title: #p freq=noraman PBEPBE/SDD
converged: NO YES NO NO
title: Mulliken charges:
elementType: S P O O O O N N C C C C C C C C C C H H H H H H H H H H H H H H H H H
charge: -0.239646 0.722162 -0.473237 -0.475280 -0.285425 -0.306701 -0.186098 0.021567 -0.614387 0.273285 -0.636824 -0.218971 0.152370 0.218147 -0.382002 -0.662626 -0.582504 -0.516129 0.282491 0.274652 0.232832 0.240629 0.240558 0.261278 0.229174 0.263894 0.210941 0.229345 0.229594 0.251031 0.254741 0.248674 0.226151 0.227048 0.289266
chargesum: 0.00000
title: Mulliken charges with hydrogens summed into heavy atoms:
elementType: S P O O O O N N C C C C C C C C C C
charge: -0.239646 0.722162 -0.473237 -0.475280 -0.285425 -0.306701 -0.186098 0.021567 -0.057243 0.273285 0.077194 0.271481 0.152370 0.218147 -0.118108 0.007254 0.171942 0.226336
polarizability: 2.18085223e+02 -4.48593445e+00 2.02829734e+02 -1.23611707e+01 -1.03001407e+01 1.42439704e+02
1716.lowfreq: -17.6292 -13.1195 -9.7200 -0.0010 0.0013 0.0015 4.2757 28.7240 39.0701
frequency: -1.1906 28.2350 39.0472 42.3517 53.6753 76.6332 78.5973 94.2741 100.5217 111.2690 113.0428 135.2812 142.6213 148.7393 183.8590 220.8559 234.0369 245.4270 262.1789 272.9889 293.6356 307.5506 316.6379 334.4915 343.3091 369.0793 417.1847 453.3374 485.8093 501.6354 545.1246 571.6949 596.6551 641.5119 649.7967 679.2734 711.7016 738.1600 774.7841 777.7708 814.9596 846.5275 876.8035 879.7209 955.7257 1002.3861 1007.2303 1016.6796 1047.7228 1063.1417 1083.8529 1105.7777 1110.9098 1120.1971 1138.8266 1152.3477 1225.0888 1239.4226 1243.7665 1256.2136 1263.6494 1275.9636 1284.2694 1344.0451 1360.2771 1393.6762 1399.3127 1416.0308 1420.8695 1422.9660 1453.0345 1454.0305 1459.2168 1473.0706 1473.5202 1480.6421 1481.9075 1484.6829 1493.8160 1499.6432 1539.9018 1582.6586 2991.6055 2993.9175 2994.7536 2997.1302 3011.8990 3032.9137 3063.2605 3089.0507 3089.4910 3093.7051 3099.7308 3106.6010 3109.4307 3114.2133 3145.9999 3153.8285 3184.9542
redmass: 4.6300 4.1908 3.3162 4.9745 2.9661 2.1153 2.8579 3.4133 1.7887 1.2140 4.3183 2.4172 2.7122 2.2183 4.2310 2.0323 1.9592 1.3929 3.6110 5.3607 3.6599 4.8557 4.2469 5.4297 5.5120 7.0248 6.0889 7.1830 7.4564 7.3908 8.7222 7.2791 5.8882 6.1053 7.4429 5.8121 4.9324 7.6684 1.3251 7.2573 1.0911 1.3915 4.8465 5.3135 3.7342 1.7079 3.3088 2.5301 1.3356 2.3420 7.0654 2.2209 1.2375 1.3275 1.4439 1.3981 2.0899 2.2465 1.2498 1.1560 6.9475 3.7425 1.6002 2.7867 1.2421 1.2461 1.1902 1.2919 1.1758 1.0803 1.0817 1.0448 1.0411 1.0408 1.0700 1.0503 1.0577 1.0476 1.1014 5.3172 7.9779 7.9434 1.0466 1.0466 1.0362 1.0311 1.0339 1.0587 1.1066 1.1006 1.0980 1.1005 1.1007 1.1024 1.1017 1.1035 1.1066 1.1025 1.0925
irintensity: 0.0307 0.2774 0.1718 0.1693 0.0940 6.3528 6.5550 1.8586 1.4932 0.4427 2.4418 1.5638 6.6797 1.0776 1.3976 2.9943 0.4289 0.4771 6.7083 4.5956 0.9524 2.8146 5.3994 20.0857 23.4928 15.0295 3.5952 14.6059 11.8449 17.8268 67.8230 31.7028 34.6732 13.0295 26.1962 50.8025 84.8408 3.8229 55.4891 5.4628 2.3607 19.1149 79.8825 81.8000 81.3193 7.2330 35.4124 78.0954 25.2776 4.2062 193.4615 12.2681 10.1896 1.4860 4.3031 1.7256 4.9463 64.2937 10.2625 2.6890 89.3738 52.7900 18.2553 49.8803 6.7928 25.1635 18.9843 28.5115 19.4394 8.5801 18.6947 16.3222 11.0051 15.7990 5.2854 16.3417 28.0809 14.9707 5.7403 17.1468 179.2573 255.2742 12.1963 38.3561 15.8063 71.4351 19.9911 3.8912 1.3002 7.2936 26.1813 15.4169 13.3965 29.7237 24.5685 14.8810 4.1930 2.4938 1.2318
temp: 298.150 k
press: 1.00000 atm
elementType: 16 15 8 8 8 8 7 7 6 6 6 6 6 6 6 6 6 6 1 1 1 1 1 1 1 1 1 1 1 1 1 1 1 1 1
symmnumber: 1
zpe: 705855.0 jmol-1
zpe.correction: 0.268846 hartree
zpe.thermalcorrener: 0.290027 hartree
zpe.thermalcorrenthalpy: 0.290971 hartree
zpe.thermalcorrgfe: 0.217253 hartree
zpe.sumelectzpe: -1539.515087 hartree
zpe.sumelectthermal: -1539.493907 hartree
zpe.sumelectthermalent: -1539.492962 hartree
zpe.sumelectthermalfe: -1539.566680 hartree
dipole: 1.3190 0.7848 -2.5633
dipole: 2.9877
quadrupole: -115.0488 -114.8164 -124.0210
quadrupole: 2.8197 -3.3073 3.3225
quadrupole: 2.9133 3.1457 -6.0590 2.8197 -3.3073 3.3225
hfenergy: -1539.7839332 hartree
pointgroup: C01 [X(C10H17N2O4P1S1)]
dipole: 0.5345996 -0.1629597 1.0340855 debye
polarizability: 215.5670449|7.7493048|203.4166661|15.272937|-11.6420373|144.37095 unknown
InChI: InChI=1S/C10H17N2O4PS/c1-5-15-17(18,6-2)16-8-7-11-12(3)10(13)9(8)14-4/h7H,5-6H2,1-4H3
charge 0 multiplicity 1
35 atoms
S  1.97177 1.504838 -1.984086
P  2.350275 0.904789 -0.042404
O  0.871181 0.839112 0.996718
O  3.139316 -0.618332 0.167121
O  -0.213275 -1.728862 0.770998
O  -3.002088 -1.892643 -0.191323
N  -3.019332 0.440481 -0.369908
N  -2.457613 1.701134 -0.343753
C  3.401889 1.936079 1.098565
C  -0.412634 0.635256 0.485447
C  2.900144 3.385843 1.210245
C  2.765853 -1.780066 -0.698902
C  -0.996949 -0.638503 0.447746
C  -2.378845 -0.788073 -0.040882
C  -1.183521 1.770336 0.067351
C  3.842279 -2.838584 -0.477708
C  -4.405892 0.372716 -0.870808
C  -0.823868 -2.908758 1.444922
H  3.383318 1.412141 2.069729
H  4.426687 1.882789 0.69285
H  3.58481 3.964023 1.855532
H  2.862636 3.876837 0.221794
H  1.892673 3.423526 1.658398
H  1.764959 -2.125293 -0.384132
H  2.726675 -1.439438 -1.751612
H  -0.743609 2.770108 0.083348
H  3.610211 -3.734953 -1.082416
H  4.83479 -2.462033 -0.778556
H  3.886724 -3.136311 0.583858
H  -5.04108 -0.164968 -0.148233
H  -4.439666 -0.178686 -1.825702
H  -4.751341 1.406192 -1.008557
H  -1.160912 -2.616868 2.455622
H  -0.000219 -3.634282 1.515774
H  -1.667248 -3.295348 0.854266
